{"text_format":"1","workbook":"xlsx","n_sheets":8,"sheets":["Individual Groups","Séries individuels","Team Groups","Séries équipes full","Feuil1","Séries équipes","Calculs","EquipesNoms"],"not_rendered":{"charts":0,"images":0,"macros":1,"external_links":0,"defined_names":47,"comments":0,"pivot_tables":0},"unopened":[],"bounds":{"document_bytes":16777216,"sheet_cells":100000,"rows_first":2000,"rows_last":500,"rows_between":2000,"halvings":0,"cell_chars":16384,"cell_head_chars":4096},"cells_cut":0,"cells_raw":0,"read":"whole","date_system":"1900"}

{"sheet":"Individual Groups","index":0,"n_rows":659,"n_cols":25,"rows_kept":659,"cut":false,"hidden":false,"merged":[]}
["Draw open individual"]
[]
["Group 1","Juan Manuel Noguera (ESP)","Daniel Cranston (USA)","Andrew Abela (MLT)","Rémi Soret (FRA)",null,null,"Open gr1 A","Open gr1 B","Open gr1 C","Open gr1 D"]
["Group 2","Saverio Bari (ITA)","Jean-Guillaume Einsle (FRA)","Janus Gersie (GER)","Brett Price (ENG)",null,null,"Open gr2 A","Open gr2 B","Open gr2 C","Open gr2 D"]
["Group 3","Luca Colangelo (ITA)","Francis Avellano (GIB)","Terry Arnold (ENG)","Malcolm Lees (SCO)",null,null,"Open gr3 A","Open gr3 B","Open gr3 C","Open gr3 D"]
["Group 4","Daniele Bertelli (ITA)","José David Somoza (ESP)","Lazaros Papakonstantinou (GRE)","Patrick Sheridan (USA)",null,null,"Open gr4 A","Open gr4 B","Open gr4 C","Open gr4 D"]
["Group 5","Massimiliano Nastasi (ITA)","Marcel Kwiatkowski (GER)","Wolfgang Leitner (AUT)","Giorgos Koutis (GRE)",null,null,"Open gr5 A","Open gr5 B","Open gr5 C","Open gr5 D"]
["Group 6","Christian Haas (AUT)","Luca Zambello (ITA)","Sami Targui (BEL)","Jean-Marie Amberny (FRA)",null,null,"Open gr6 A","Open gr6 B","Open gr6 C","Open gr6 D"]
["Group 7","Spyros Hatzaras (GRE)","Alexander Ruf (GER)","Fayçal Rouis (FRA)","Thomas Wittmann (AUT)",null,null,"Open gr7 A","Open gr7 B","Open gr7 C","Open gr7 D"]
["Group 8","Alexander Haas (AUT)","Valéry Dejardin (BEL)","Frank Hagenkötter (GER)","Romain Lafontaine (FRA)",null,null,"Open gr8 A","Open gr8 B","Open gr8 C","Open gr8 D"]
["Group 9","Sébastien Scheen (BEL)","Heinz Eder (AUT)","Julio Candélas (ESP)","Velissarios Fragakis (GRE)",null,null,"Open gr9 A","Open gr9 B","Open gr9 C","Open gr9 D"]
["Group 10","Justin Leroy (BEL)","Marcus Tilgner (GER)","Juan Carlos Pinto (ESP)","Massimo Bolognino (ITA)",null,null,"Open gr10 A","Open gr10 B","Open gr10 C","Open gr10 D"]
["Group 11","Christophe Dheur (BEL)","Jonathan Dotto (GIB)","Kostas Stamokostas (GRE)","Raffaele Lombardi (AUS)",null,null,"Open gr11 A","Open gr11 B","Open gr11 C","Open gr11 D"]
["Group 12","Angelo Borg (MLT)","Suguru Fujino (JPN)","Bessim Golger (BEL)","Mike Tillman (USA)",null,null,"Open gr12 A","Open gr12 B","Open gr12 C","Open gr12 D"]
["Group 13","Sérgio Ramos (POR)","Lawrence Alvarez (GIB)","Rémy Huynh (BEL)","Christian Filippella (USA)",null,null,"Open gr13 A","Open gr13 B","Open gr13 C","Open gr13 D"]
["Group 14","Kostas Seses (GRE)","Axel Donval (FRA)","Nuno Henriques (POR)","Luca Martinelli (ENG)",null,null,"Open gr14 A","Open gr14 B","Open gr14 C","Open gr14 D"]
["Group 15","Derek Conti (MLT)","Anton V. Aleksadrovich (RUS)","Gareth Christie (SCO)","Spyros Patrinos (GRE)",null,null,"Open gr15 A","Open gr15 B","Open gr15 C","Open gr15 D"]
["Group 16","Wolfgang Haas (AUT)","Dmitry L. Valeriavitch (RUS)","Luis Abreu (POR)","Maikel de Haas (NED)",null,null,"Open gr16 A","Open gr16 B","Open gr16 C","Open gr16 D"]
[]
["Draw veteran individuel"]
[]
["Group 1","Antonio Montaño (ESP)","Patrick Dean (GIB)","Dario Passadore (USA)","Francesco Mattiangeli (ITA)",null,null,"Vet gr1 A","Vet gr1 B","Vet gr1 C","Vet gr1 D"]
["Group 2","Pascal Scheen (BEL)","Mat Atkin (ENG)","Panagiotis Haratsis (GRE)","Andreas Jung (GER)",null,null,"Vet gr2 A","Vet gr2 B","Vet gr2 C","Vet gr2 D"]
["Group 3","Vicenç Prats Salat (ESP)","Frank Stiller (GER)","Henk Landzaat (NED)","Paul Eyes (USA)",null,null,"Vet gr3 A","Vet gr3 B","Vet gr3 C","Vet gr3 D"]
["Group 4","Daniel Scheen (BEL)","Karl-Heinz Haider (AUT)","Richard Berllaque (GIB)","Jeremy Bradley (ENG)",null,null,"Vet gr4 A","Vet gr4 B","Vet gr4 C","Vet gr4 D"]
["Group 5","Günther Bamberzky (AUT)","Xavier Dubois (FRA)","Paul O’Donovan Rossa (USA)","Phil Redman (ENG)",null,null,"Vet gr5 A","Vet gr5 B","Vet gr5 C","Vet gr5 D"]
["Group 6","Gianfranco Calonico (ITA)","Arturo Martínez (ESP)","Axel Modeste (FRA)","Andrey K. Nicolaevich (RUS)",null,null,"Vet gr6 A","Vet gr6 B","Vet gr6 C","Vet gr6 D"]
["Group 7","Erich Hinkelmann (AUT)","Davide Lazzari (CZE)","Benoît Massart (BEL)","Luis Domingo L. Gutiérrez (ESP)",null,null,"Vet gr7 A","Vet gr7 B","Vet gr7 C","Vet gr7 D"]
["Group 8","Chris Aggelinas (GRE)","Éric Naszalyi (FRA)","Hideaki Wada (JPN)","Rob Conway (SCO)",null,null,"Vet gr8 A","Vet gr8 B","Vet gr8 C","Vet gr8 D"]
["Group 9","John Field (GIB)","Giorgos Drazinakis (GRE)","Patrick de Jong (NED)","Massimiliano Croatti (ITA)",null,null,"Vet gr9 A","Vet gr9 B","Vet gr9 C","Vet gr9 D"]
["Group 10","Jason Pisani (MLT)","Dimitris Stamatopoulos (GRE)","Stéphane Pommier (FRA)","Marco Zucchi (CZE)",null,null,"Vet gr10 A","Vet gr10 B","Vet gr10 C","Vet gr10 D"]
["Group 11","Charles Aquilina (MLT)","Andy Beskaby (SCO)","Brian Daley (ENG)","Rainer Vogt (GER)",null,null,"Vet gr11 A","Vet gr11 B","Vet gr11 C","Vet gr11 D"]
["Group 12","Eric Threis (BEL)","Tom Horn (GER)","Giorgos Aggelinas (GRE)","John Zammit (MLT)",null,null,"Vet gr12 A","Vet gr12 B","Vet gr12 C","Vet gr12 D"]
["Group 13","Alain Jadot (BEL)","Ferrán Coll (ESP)","Robert Green (AUS)","Jose Luis Bonavia (GIB)",null,null,"Vet gr13 A","Vet gr13 B","Vet gr13 C","Vet gr13 D"]
["Group 14","Manfred Pawlica (AUT)","Stefano De Francesco (ITA)","Thierry Vivron (FRA)","Arnold Mair (GER)",null,null,"Vet gr14 A","Vet gr14 B","Vet gr14 C","Vet gr14 D"]
["Group 15","Patrizio Lazzaretti (ITA)","Gregg Deinhart (USA)","Justin Finch (ENG)","Guy Palmer (GIB)",null,null,"Vet gr15 A","Vet gr15 B","Vet gr15 C","Vet gr15 D"]
["Group 16","David Busch (AUT)","Massimo Cremona (MLT)","Juan Carlos Granados (ESP)","Vito Di Ruggiero (BEL)",null,null,"Vet gr16 A","Vet gr16 B","Vet gr16 C","Vet gr16 D"]
[]
["Draw ladies individual"]
[]
["Group 1","Paola Forlani (ITA)","Maike Krause (GER)","Lydie Pinchart (BEL)","Elodie Bertholet (BEL)",null,null,"Ladies gr1 A","Ladies gr1 B","Ladies gr1 C","Ladies gr1 D"]
["Group 2","Emilie Despretz (BEL)","Arielle Briant (FRA)","Paula Maireles  (ESP)","Eleonora Buttitta (ITA)",null,null,"Ladies gr2 A","Ladies gr2 B","Ladies gr2 C","Ladies gr2 D"]
["Group 3","Audrey Herbaut (FRA)","Alyssa Guyaux (BEL)","Julia Eglicerio (ESP)","Conny Vulpes (GER)",null,null,"Ladies gr3 A","Ladies gr3 B","Ladies gr3 C","Ladies gr3 D"]
["Group 4","Victoria Büsing (GER)","Carolina Villarigues (POR)","Manon Willem (BEL)","Kimberley Devreese (BEL)",null,null,"Ladies gr4 A","Ladies gr4 B","Ladies gr4 C","Ladies gr4 D"]
["Group 5","Delphine Dieudonne (BEL)","Mélanie Falcone (BEL)","Mirjam de Jong (NED)","Helène Boniface (ITA)",null,null,"Ladies gr5 A","Ladies gr5 B","Ladies gr5 C","Ladies gr5 D"]
["Group 6","Giulia Brillantino (ITA)","Françoise Guyot (FRA)","Daria Prazynski (GER)","Cynthia Bouchez (BEL)",null,null,"Ladies gr6 A","Ladies gr6 B","Ladies gr6 C","Ladies gr6 D"]
["Group 7","Margault Delval (BEL)","Isabelle Daelman (BEL)","Giuditta Lo Cascio (ITA)","Sylvie Guyot (FRA)",null,null,"Ladies gr7 A","Ladies gr7 B","Ladies gr7 C","Ladies gr7 D"]
[]
[]
["Draw U19 individual"]
[]
["Group 1","Florian Giaux (BEL)","Jody Henrioul (BEL)","Connor Bowden (ENG)","Nikos Haratsis (GRE)",null,null,"U19 gr1 A","U19 gr1 B","U19 gr1 C","U19 gr1 D"]
["Group 2","David González (ESP)","Nathan Dizier (BEL)","Koshiro Shibata (JPN)","Marco Di Vito (ITA)",null,null,"U19 gr2 A","U19 gr2 B","U19 gr2 C","U19 gr2 D"]
["Group 3","Nicola Borgo (ITA)","Christopher Bowen (ENG)","Jesús Moreno (ESP)","Martin Antoine (BEL)",null,null,"U19 gr3 A","U19 gr3 B","U19 gr3 C","U19 gr3 D"]
["Group 4","Steffen Despretz (BEL)","Andrea Ciccarelli (ITA)","Nealmark Bonnici (MLT)","Fabio Bianco (GER)",null,null,"U19 gr4 A","U19 gr4 B","U19 gr4 C","U19 gr4 D"]
["Group 5","Antonio Casin (ESP)","Quentin Van Glabeke (BEL)","Théo Modeste (FRA)","Ricardo Jose (POR)",null,null,"U19 gr5 A","U19 gr5 B","U19 gr5 C","U19 gr5 D"]
["Group 6","Raphaël Pommier (FRA)","Corentin Wauthy (BEL)","Afonso Pereira (POR)","Paolo Zambello (ITA)",null,null,"U19 gr6 A","U19 gr6 B","U19 gr6 C","U19 gr6 D"]
["Group 7","Elliott Bellefontaine (ENG)","William Van den Houte (BEL)","Claudio Panebianco (ITA)","Arnaud Le Téno (FRA)",null,null,"U19 gr7 A","U19 gr7 B","U19 gr7 C","U19 gr7 D"]
["Group 8","Matteo Ciccarelli (ITA)","Kai Hagenkötter (GER)","Maxime Muraille (BEL)","Paul Naszalyi (FRA)",null,null,"U19 gr8 A","U19 gr8 B","U19 gr8 C","U19 gr8 D"]
[]
["Draw U15 individual"]
[]
["Group 1","Maxime Rairoux (BEL)","Florentine Ausset (FRA)","Riccardo Lazzari (ITA)","Adam Kraus (AUT)",null,null,"U15 gr1 A","U15 gr1 B","U15 gr1 C","U15 gr1 D"]
["Group 2","Marios Strommer (AUT)","Andrea Bolognino (ITA)","Vasco Henriques (POR)","Manuel Politz (GER)",null,null,"U15 gr2 A","U15 gr2 B","U15 gr2 C","U15 gr2 D"]
["Group 3","Corentin Bouchez (BEL)","Gonzalo García-Guereta (ESP)","Daniel Vranovitz (AUT)","Claudio La Torre (ITA)",null,null,"U15 gr3 A","U15 gr3 B","U15 gr3 C","U15 gr3 D"]
["Group 4","Jurgen Balzan (MLT)","Yannick Matusch (GER)","Louison Giaux (BEL)","Jorge Pinero (ESP)",null,null,"U15 gr4 A","U15 gr4 B","U15 gr4 C","U15 gr4 D"]
["Group 5","Leonardo Giudice (ITA)","Niall Dean (GIB)","Thomas Price (ENG)","Corentin Boltz (BEL)",null,null,"U15 gr5 A","U15 gr5 B","U15 gr5 C","U15 gr5 D"]
["Group 6","Alwin Krause (GER)","Antonio García Fernández (ESP)","Eliott Legall (FRA)","Jonathan Nichtenberger (AUT)",null,null,"U15 gr6 A","U15 gr6 B","U15 gr6 C","U15 gr6 D"]
["Group 7","Kye Arnold (ENG)","Moritz Jung (GER)","Antonio La Torre (ITA)","Paul Offmann (FRA)",null,null,"U15 gr7 A","U15 gr7 B","U15 gr7 C","U15 gr7 D"]
["Group 8","Lukas Eppensteiner (AUT)","Matteo Brillantino (ITA)","Rhys Williams (ENG)","Mathéo Grégoire (BEL)",null,null,"U15 gr8 A","U15 gr8 B","U15 gr8 C","U15 gr8 D"]
[]
["Draw U12 individual"]
[]
["Group 1","Matteo Cammarata (ITA)","Victor Dubuc (FRA)","Jérôme Cyganek (BEL)","Charlotte Bouchez (BEL)",null,null,"U12 gr1 A","U12 gr1 B","U12 gr1 C","U12 gr1 D"]
["Group 2","Lucas Pere (BEL)","Lucie Baudour (BEL)","Louis Fouetillou (FRA)","Mattia Ferrante (ITA)",null,null,"U12 gr2 A","U12 gr2 B","U12 gr2 C","U12 gr2 D"]
["Group 3","Basile Magermans (BEL)","Léa Despretz (BEL)","Diogo Pereira (POR)","Carlos Pinto (ESP)",null,null,"U12 gr3 A","U12 gr3 B","U12 gr3 C","U12 gr3 D"]
["Group 4","Riccardo Natoli (ITA)","Jann Segers (BEL)","Conor Atkin (ENG)","Quentin Ausset (FRA)",null,null,"U12 gr4 A","U12 gr4 B","U12 gr4 C","U12 gr4 D"]
["Group 5","Francesco Tozzi (ITA)","Gabriel Lombardi (AUS)","Noah Denne (BEL)","Jesús Maireles (ESP)",null,null,"U12 gr5 A","U12 gr5 B","U12 gr5 C","U12 gr5 D"]
["Group 6","Giorgio Giudice (ITA)","Joseph Agius (MLT)","Mark Offmann (FRA)","Alex Genart (BEL)",null,null,"U12 gr6 A","U12 gr6 B","U12 gr6 C","U12 gr6 D"]
["Group 7","Joshua Foreman (ENG)","Kristian Silagiev (ESP)","Cristian Fricano  (ITA)","Aurélien Feye (BEL)",null,null,"U12 gr7 A","U12 gr7 B","U12 gr7 C","U12 gr7 D"]
[]
[]
[]
["1st round"]
[]
["Open category"]
[]
["Group 1"]
[]
[{"$f":"B3","v":"Juan Manuel Noguera (ESP)"},{"$f":"IF('Séries individuels'!D6=\"\",\"\",'Séries individuels'!D6)","v":6},"-",{"$f":"IF('Séries individuels'!F6=\"\",\"\",'Séries individuels'!F6)","v":2},{"$f":"C3","v":"Daniel Cranston (USA)"},null,null,"P","W","L","N","+","-","d","PTS",null,null,"P","W","L","N","+","-","d","PTS"]
[{"$f":"D3","v":"Andrew Abela (MLT)"},{"$f":"IF('Séries individuels'!D7=\"\",\"\",'Séries individuels'!D7)","v":0},"-",{"$f":"IF('Séries individuels'!F7=\"\",\"\",'Séries individuels'!F7)","v":5},{"$f":"E3","v":"Rémi Soret (FRA)"},null,{"$f":"A90","v":"Juan Manuel Noguera (ESP)"},{"$f":"IF(B90=\"\",0,1)+IF(B92=\"\",0,1)+IF(D94=\"\",0,1)","v":3},{"$f":"IF(B90>D90,1,0)+IF(B92>D92,1,0)+IF(D94>B94,1,0)","v":3},{"$f":"IF(B90<D90,1,0)+IF(B92<D92,1,0)+IF(D94<B94,1,0)","v":0},{"$f":"IF(B90=\"\",0,IF(B90=D90,1,0))+IF(B92=\"\",0,IF(B92=D92,1,0))+IF(B94=\"\",0,IF(B94=D94,1,0))","v":0},{"$f":"IF(B90=\"\",0,+B90)+IF(B92=\"\",0,+B92)+IF(D94=\"\",0,+D94)","v":18},{"$f":"IF(D90=\"\",0,+D90)+IF(D92=\"\",0,+D92)+IF(B94=\"\",0,+B94)","v":5},{"$f":"L91-M91","v":13},{"$f":"I91*3+K91","v":9},null,"Juan Manuel Noguera (ESP)",3,3,0,0,18,5,13,9]
[{"$f":"B3","v":"Juan Manuel Noguera (ESP)"},{"$f":"IF('Séries individuels'!D140=\"\",\"\",'Séries individuels'!D140)","v":8},"-",{"$f":"IF('Séries individuels'!F140=\"\",\"\",'Séries individuels'!F140)","v":1},{"$f":"D3","v":"Andrew Abela (MLT)"},null,{"$f":"E90","v":"Daniel Cranston (USA)"},{"$f":"IF(D90=\"\",0,1)+IF(B93=\"\",0,1)+IF(B95=\"\",0,1)","v":3},{"$f":"IF(D90>B90,1,0)+IF(B93>D93,1,0)+IF(B95>D95,1,0)","v":1},{"$f":"IF(D90<B90,1,0)+IF(B93<D93,1,0)+IF(B95<D95,1,0)","v":2},{"$f":"IF(B90=\"\",0,IF(B90=D90,1,0))+IF(B93=\"\",0,IF(B93=D93,1,0))+IF(B95=\"\",0,IF(B95=D95,1,0))","v":0},{"$f":"IF(D90=\"\",0,+D90)+IF(B93=\"\",0,+B93)+IF(B95=\"\",0,+B95)","v":6},{"$f":"IF(B90=\"\",0,+B90)+IF(D93=\"\",0,+D93)+IF(D95=\"\",0,+D95)","v":9},{"$f":"L92-M92","v":-3},{"$f":"I92*3+K92","v":3},null,"Rémi Soret (FRA)",3,2,1,0,9,4,5,6]
[{"$f":"C3","v":"Daniel Cranston (USA)"},{"$f":"IF('Séries individuels'!D141=\"\",\"\",'Séries individuels'!D141)","v":0},"-",{"$f":"IF('Séries individuels'!F141=\"\",\"\",'Séries individuels'!F141)","v":2},{"$f":"E3","v":"Rémi Soret (FRA)"},null,{"$f":"A91","v":"Andrew Abela (MLT)"},{"$f":"IF(B91=\"\",0,1)+IF(D92=\"\",0,1)+IF(D95=\"\",0,1)","v":3},{"$f":"IF(B91>D91,1,0)+IF(D92>B92,1,0)+IF(D95>B95,1,0)","v":0},{"$f":"IF(B91<D91,1,0)+IF(D92<B92,1,0)+IF(D95<B95,1,0)","v":3},{"$f":"IF(B91=\"\",0,IF(B91=D91,1,0))+IF(B92=\"\",0,IF(B92=D92,1,0))+IF(B95=\"\",0,IF(B95=D95,1,0))","v":0},{"$f":"IF(B91=\"\",0,+B91)+IF(D92=\"\",0,+D92)+IF(D95=\"\",0,+D95)","v":2},{"$f":"IF(D91=\"\",0,+D91)+IF(B92=\"\",0,+B92)+IF(B95=\"\",0,+B95)","v":17},{"$f":"L93-M93","v":-15},{"$f":"I93*3+K93","v":0},null,"Daniel Cranston (USA)",3,1,2,0,6,9,-3,3]
[{"$f":"E3","v":"Rémi Soret (FRA)"},{"$f":"IF('Séries individuels'!D274=\"\",\"\",'Séries individuels'!D274)","v":2},"-",{"$f":"IF('Séries individuels'!F274=\"\",\"\",'Séries individuels'!F274)","v":4},{"$f":"B3","v":"Juan Manuel Noguera (ESP)"},null,{"$f":"E91","v":"Rémi Soret (FRA)"},{"$f":"IF(D91=\"\",0,1)+IF(D93=\"\",0,1)+IF(B94=\"\",0,1)","v":3},{"$f":"IF(D91>B91,1,0)+IF(D93>B93,1,0)+IF(B94>D94,1,0)","v":2},{"$f":"IF(D91<B91,1,0)+IF(D93<B93,1,0)+IF(B94<D94,1,0)","v":1},{"$f":"IF(B91=\"\",0,IF(B91=D91,1,0))+IF(B93=\"\",0,IF(B93=D93,1,0))+IF(B94=\"\",0,IF(B94=D94,1,0))","v":0},{"$f":"IF(D91=\"\",0,+D91)+IF(D93=\"\",0,+D93)+IF(B94=\"\",0,+B94)","v":9},{"$f":"IF(B91=\"\",0,+B91)+IF(B93=\"\",0,+B93)+IF(D94=\"\",0,+D94)","v":4},{"$f":"L94-M94","v":5},{"$f":"I94*3+K94","v":6},null,"Andrew Abela (MLT)",3,0,3,0,2,17,-15,0]
[{"$f":"C3","v":"Daniel Cranston (USA)"},{"$f":"IF('Séries individuels'!D275=\"\",\"\",'Séries individuels'!D275)","v":4},"-",{"$f":"IF('Séries individuels'!F275=\"\",\"\",'Séries individuels'!F275)","v":1},{"$f":"D3","v":"Andrew Abela (MLT)"},null,null,null,{"$f":"SUM(I91:I94)","v":6},6,0,35,35,0]
[]
["Group 2"]
[]
[{"$f":"B4","v":"Saverio Bari (ITA)"},{"$f":"IF('Séries individuels'!D8=\"\",\"\",'Séries individuels'!D8)","v":3},"-",{"$f":"IF('Séries individuels'!F8=\"\",\"\",'Séries individuels'!F8)","v":3},{"$f":"C4","v":"Jean-Guillaume Einsle (FRA)"},null,null,"P","W","L","N","+","-","d","PTS",null,null,"P","W","L","N","+","-","d","PTS"]
[{"$f":"D4","v":"Janus Gersie (GER)"},{"$f":"IF('Séries individuels'!D9=\"\",\"\",'Séries individuels'!D9)","v":5},"-",{"$f":"IF('Séries individuels'!F9=\"\",\"\",'Séries individuels'!F9)","v":2},{"$f":"E4","v":"Brett Price (ENG)"},null,{"$f":"A99","v":"Saverio Bari (ITA)"},{"$f":"IF(B99=\"\",0,1)+IF(B101=\"\",0,1)+IF(D103=\"\",0,1)","v":3},{"$f":"IF(B99>D99,1,0)+IF(B101>D101,1,0)+IF(D103>B103,1,0)","v":2},{"$f":"IF(B99<D99,1,0)+IF(B101<D101,1,0)+IF(D103<B103,1,0)","v":0},{"$f":"IF(B99=\"\",0,IF(B99=D99,1,0))+IF(B101=\"\",0,IF(B101=D101,1,0))+IF(B103=\"\",0,IF(B103=D103,1,0))","v":1},{"$f":"IF(B99=\"\",0,+B99)+IF(B101=\"\",0,+B101)+IF(D103=\"\",0,+D103)","v":20},{"$f":"IF(D99=\"\",0,+D99)+IF(D101=\"\",0,+D101)+IF(B103=\"\",0,+B103)","v":4},{"$f":"L100-M100","v":16},{"$f":"I100*3+K100","v":7},null,"Saverio Bari (ITA)",3,2,0,1,20,4,16,7]
[{"$f":"B4","v":"Saverio Bari (ITA)"},{"$f":"IF('Séries individuels'!D142=\"\",\"\",'Séries individuels'!D142)","v":7},"-",{"$f":"IF('Séries individuels'!F142=\"\",\"\",'Séries individuels'!F142)","v":1},{"$f":"D4","v":"Janus Gersie (GER)"},null,{"$f":"E99","v":"Jean-Guillaume Einsle (FRA)"},{"$f":"IF(D99=\"\",0,1)+IF(B102=\"\",0,1)+IF(B104=\"\",0,1)","v":3},{"$f":"IF(D99>B99,1,0)+IF(B102>D102,1,0)+IF(B104>D104,1,0)","v":2},{"$f":"IF(D99<B99,1,0)+IF(B102<D102,1,0)+IF(B104<D104,1,0)","v":0},{"$f":"IF(B99=\"\",0,IF(B99=D99,1,0))+IF(B102=\"\",0,IF(B102=D102,1,0))+IF(B104=\"\",0,IF(B104=D104,1,0))","v":1},{"$f":"IF(D99=\"\",0,+D99)+IF(B102=\"\",0,+B102)+IF(B104=\"\",0,+B104)","v":18},{"$f":"IF(B99=\"\",0,+B99)+IF(D102=\"\",0,+D102)+IF(D104=\"\",0,+D104)","v":4},{"$f":"L101-M101","v":14},{"$f":"I101*3+K101","v":7},null,"Jean-Guillaume Einsle (FRA)",3,2,0,1,18,4,14,7]
[{"$f":"C4","v":"Jean-Guillaume Einsle (FRA)"},{"$f":"IF('Séries individuels'!D143=\"\",\"\",'Séries individuels'!D143)","v":10},"-",{"$f":"IF('Séries individuels'!F143=\"\",\"\",'Séries individuels'!F143)","v":0},{"$f":"E4","v":"Brett Price (ENG)"},null,{"$f":"A100","v":"Janus Gersie (GER)"},{"$f":"IF(B100=\"\",0,1)+IF(D101=\"\",0,1)+IF(D104=\"\",0,1)","v":3},{"$f":"IF(B100>D100,1,0)+IF(D101>B101,1,0)+IF(D104>B104,1,0)","v":1},{"$f":"IF(B100<D100,1,0)+IF(D101<B101,1,0)+IF(D104<B104,1,0)","v":2},{"$f":"IF(B100=\"\",0,IF(B100=D100,1,0))+IF(B101=\"\",0,IF(B101=D101,1,0))+IF(B104=\"\",0,IF(B104=D104,1,0))","v":0},{"$f":"IF(B100=\"\",0,+B100)+IF(D101=\"\",0,+D101)+IF(D104=\"\",0,+D104)","v":7},{"$f":"IF(D100=\"\",0,+D100)+IF(B101=\"\",0,+B101)+IF(B104=\"\",0,+B104)","v":14},{"$f":"L102-M102","v":-7},{"$f":"I102*3+K102","v":3},null,"Janus Gersie (GER)",3,1,2,0,7,14,-7,3]
[{"$f":"E4","v":"Brett Price (ENG)"},{"$f":"IF('Séries individuels'!D276=\"\",\"\",'Séries individuels'!D276)","v":0},"-",{"$f":"IF('Séries individuels'!F276=\"\",\"\",'Séries individuels'!F276)","v":10},{"$f":"B4","v":"Saverio Bari (ITA)"},null,{"$f":"E100","v":"Brett Price (ENG)"},{"$f":"IF(D100=\"\",0,1)+IF(D102=\"\",0,1)+IF(B103=\"\",0,1)","v":3},{"$f":"IF(D100>B100,1,0)+IF(D102>B102,1,0)+IF(B103>D103,1,0)","v":0},{"$f":"IF(D100<B100,1,0)+IF(D102<B102,1,0)+IF(B103<D103,1,0)","v":3},{"$f":"IF(B100=\"\",0,IF(B100=D100,1,0))+IF(B102=\"\",0,IF(B102=D102,1,0))+IF(B103=\"\",0,IF(B103=D103,1,0))","v":0},{"$f":"IF(D100=\"\",0,+D100)+IF(D102=\"\",0,+D102)+IF(B103=\"\",0,+B103)","v":2},{"$f":"IF(B100=\"\",0,+B100)+IF(B102=\"\",0,+B102)+IF(D103=\"\",0,+D103)","v":25},{"$f":"L103-M103","v":-23},{"$f":"I103*3+K103","v":0},null,"Brett Price (ENG)",3,0,3,0,2,25,-23,0]
[{"$f":"C4","v":"Jean-Guillaume Einsle (FRA)"},{"$f":"IF('Séries individuels'!D277=\"\",\"\",'Séries individuels'!D277)","v":5},"-",{"$f":"IF('Séries individuels'!F277=\"\",\"\",'Séries individuels'!F277)","v":1},{"$f":"D4","v":"Janus Gersie (GER)"},null,null,null,{"$f":"SUM(I100:I103)","v":5},{"$f":"SUM(J100:J103)","v":5},{"$f":"SUM(K100:K103)","v":2},{"$f":"SUM(L100:L103)","v":47},{"$f":"SUM(M100:M103)","v":47},{"$f":"SUM(N100:N103)","v":0}]
[]
["Group 3"]
[]
[{"$f":"$B5","v":"Luca Colangelo (ITA)"},{"$f":"IF('Séries individuels'!D10=\"\",\"\",'Séries individuels'!D10)","v":7},"-",{"$f":"IF('Séries individuels'!F10=\"\",\"\",'Séries individuels'!F10)","v":1},{"$f":"$C5","v":"Francis Avellano (GIB)"},null,null,"P","W","L","N","+","-","d","PTS",null,null,"P","W","L","N","+","-","d","PTS"]
[{"$f":"$D5","v":"Terry Arnold (ENG)"},{"$f":"IF('Séries individuels'!D11=\"\",\"\",'Séries individuels'!D11)","v":2},"-",{"$f":"IF('Séries individuels'!F11=\"\",\"\",'Séries individuels'!F11)","v":11},{"$f":"$E5","v":"Malcolm Lees (SCO)"},null,{"$f":"A108","v":"Luca Colangelo (ITA)"},{"$f":"IF(B108=\"\",0,1)+IF(B110=\"\",0,1)+IF(D112=\"\",0,1)","v":3},{"$f":"IF(B108>D108,1,0)+IF(B110>D110,1,0)+IF(D112>B112,1,0)","v":3},{"$f":"IF(B108<D108,1,0)+IF(B110<D110,1,0)+IF(D112<B112,1,0)","v":0},{"$f":"IF(B108=\"\",0,IF(B108=D108,1,0))+IF(B110=\"\",0,IF(B110=D110,1,0))+IF(B112=\"\",0,IF(B112=D112,1,0))","v":0},{"$f":"IF(B108=\"\",0,+B108)+IF(B110=\"\",0,+B110)+IF(D112=\"\",0,+D112)","v":29},{"$f":"IF(D108=\"\",0,+D108)+IF(D110=\"\",0,+D110)+IF(B112=\"\",0,+B112)","v":2},{"$f":"L109-M109","v":27},{"$f":"I109*3+K109","v":9},null,"Luca Colangelo (ITA)",3,3,0,0,29,2,27,9]
[{"$f":"$A108","v":"Luca Colangelo (ITA)"},{"$f":"IF('Séries individuels'!D144=\"\",\"\",'Séries individuels'!D144)","v":13},"-",{"$f":"IF('Séries individuels'!F144=\"\",\"\",'Séries individuels'!F144)","v":1},{"$f":"$A109","v":"Terry Arnold (ENG)"},null,{"$f":"E108","v":"Francis Avellano (GIB)"},{"$f":"IF(D108=\"\",0,1)+IF(B111=\"\",0,1)+IF(B113=\"\",0,1)","v":3},{"$f":"IF(D108>B108,1,0)+IF(B111>D111,1,0)+IF(B113>D113,1,0)","v":1},{"$f":"IF(D108<B108,1,0)+IF(B111<D111,1,0)+IF(B113<D113,1,0)","v":2},{"$f":"IF(B108=\"\",0,IF(B108=D108,1,0))+IF(B111=\"\",0,IF(B111=D111,1,0))+IF(B113=\"\",0,IF(B113=D113,1,0))","v":0},{"$f":"IF(D108=\"\",0,+D108)+IF(B111=\"\",0,+B111)+IF(B113=\"\",0,+B113)","v":7},{"$f":"IF(B108=\"\",0,+B108)+IF(D111=\"\",0,+D111)+IF(D113=\"\",0,+D113)","v":13},{"$f":"L110-M110","v":-6},{"$f":"I110*3+K110","v":3},null,"Malcolm Lees (SCO)",3,2,1,0,14,12,2,6]
[{"$f":"$E108","v":"Francis Avellano (GIB)"},{"$f":"IF('Séries individuels'!D145=\"\",\"\",'Séries individuels'!D145)","v":1},"-",{"$f":"IF('Séries individuels'!F145=\"\",\"\",'Séries individuels'!F145)","v":3},{"$f":"$E109","v":"Malcolm Lees (SCO)"},null,{"$f":"A109","v":"Terry Arnold (ENG)"},{"$f":"IF(B109=\"\",0,1)+IF(D110=\"\",0,1)+IF(D113=\"\",0,1)","v":3},{"$f":"IF(B109>D109,1,0)+IF(D110>B110,1,0)+IF(D113>B113,1,0)","v":0},{"$f":"IF(B109<D109,1,0)+IF(D110<B110,1,0)+IF(D113<B113,1,0)","v":3},{"$f":"IF(B109=\"\",0,IF(B109=D109,1,0))+IF(B110=\"\",0,IF(B110=D110,1,0))+IF(B113=\"\",0,IF(B113=D113,1,0))","v":0},{"$f":"IF(B109=\"\",0,+B109)+IF(D110=\"\",0,+D110)+IF(D113=\"\",0,+D113)","v":6},{"$f":"IF(D109=\"\",0,+D109)+IF(B110=\"\",0,+B110)+IF(B113=\"\",0,+B113)","v":29},{"$f":"L111-M111","v":-23},{"$f":"I111*3+K111","v":0},null,"Francis Avellano (GIB)",3,1,2,0,7,13,-6,3]
[{"$f":"$E109","v":"Malcolm Lees (SCO)"},{"$f":"IF('Séries individuels'!D278=\"\",\"\",'Séries individuels'!D278)","v":0},"-",{"$f":"IF('Séries individuels'!F278=\"\",\"\",'Séries individuels'!F278)","v":9},{"$f":"$A108","v":"Luca Colangelo (ITA)"},null,{"$f":"E109","v":"Malcolm Lees (SCO)"},{"$f":"IF(D109=\"\",0,1)+IF(D111=\"\",0,1)+IF(B112=\"\",0,1)","v":3},{"$f":"IF(D109>B109,1,0)+IF(D111>B111,1,0)+IF(B112>D112,1,0)","v":2},{"$f":"IF(D109<B109,1,0)+IF(D111<B111,1,0)+IF(B112<D112,1,0)","v":1},{"$f":"IF(B109=\"\",0,IF(B109=D109,1,0))+IF(B111=\"\",0,IF(B111=D111,1,0))+IF(B112=\"\",0,IF(B112=D112,1,0))","v":0},{"$f":"IF(D109=\"\",0,+D109)+IF(D111=\"\",0,+D111)+IF(B112=\"\",0,+B112)","v":14},{"$f":"IF(B109=\"\",0,+B109)+IF(B111=\"\",0,+B111)+IF(D112=\"\",0,+D112)","v":12},{"$f":"L112-M112","v":2},{"$f":"I112*3+K112","v":6},null,"Terry Arnold (ENG)",3,0,3,0,6,29,-23,0]
[{"$f":"$E108","v":"Francis Avellano (GIB)"},{"$f":"IF('Séries individuels'!D279=\"\",\"\",'Séries individuels'!D279)","v":5},"-",{"$f":"IF('Séries individuels'!F279=\"\",\"\",'Séries individuels'!F279)","v":3},{"$f":"$A109","v":"Terry Arnold (ENG)"},null,null,null,{"$f":"SUM(I109:I112)","v":6},{"$f":"SUM(J109:J112)","v":6},{"$f":"SUM(K109:K112)","v":0},{"$f":"SUM(L109:L112)","v":56},{"$f":"SUM(M109:M112)","v":56},{"$f":"SUM(N109:N112)","v":0}]
[]
["Group 4"]
[]
[{"$f":"$B6","v":"Daniele Bertelli (ITA)"},{"$f":"IF('Séries individuels'!D12=\"\",\"\",'Séries individuels'!D12)","v":7},"-",{"$f":"IF('Séries individuels'!F12=\"\",\"\",'Séries individuels'!F12)","v":0},{"$f":"$C6","v":"José David Somoza (ESP)"},null,null,"P","W","L","N","+","-","d","PTS",null,null,"P","W","L","N","+","-","d","PTS"]
[{"$f":"$D6","v":"Lazaros Papakonstantinou (GRE)"},{"$f":"IF('Séries individuels'!D13=\"\",\"\",'Séries individuels'!D13)","v":3},"-",{"$f":"IF('Séries individuels'!F13=\"\",\"\",'Séries individuels'!F13)","v":1},{"$f":"$E6","v":"Patrick Sheridan (USA)"},null,{"$f":"A117","v":"Daniele Bertelli (ITA)"},{"$f":"IF(B117=\"\",0,1)+IF(B119=\"\",0,1)+IF(D121=\"\",0,1)","v":3},{"$f":"IF(B117>D117,1,0)+IF(B119>D119,1,0)+IF(D121>B121,1,0)","v":3},{"$f":"IF(B117<D117,1,0)+IF(B119<D119,1,0)+IF(D121<B121,1,0)","v":0},{"$f":"IF(B117=\"\",0,IF(B117=D117,1,0))+IF(B119=\"\",0,IF(B119=D119,1,0))+IF(B121=\"\",0,IF(B121=D121,1,0))","v":0},{"$f":"IF(B117=\"\",0,+B117)+IF(B119=\"\",0,+B119)+IF(D121=\"\",0,+D121)","v":25},{"$f":"IF(D117=\"\",0,+D117)+IF(D119=\"\",0,+D119)+IF(B121=\"\",0,+B121)","v":4},{"$f":"L118-M118","v":21},{"$f":"I118*3+K118","v":9},null,"Daniele Bertelli (ITA)",3,3,0,0,25,4,21,9]
[{"$f":"$B6","v":"Daniele Bertelli (ITA)"},{"$f":"IF('Séries individuels'!D146=\"\",\"\",'Séries individuels'!D146)","v":8},"-",{"$f":"IF('Séries individuels'!F146=\"\",\"\",'Séries individuels'!F146)","v":2},{"$f":"$D6","v":"Lazaros Papakonstantinou (GRE)"},null,{"$f":"E117","v":"José David Somoza (ESP)"},{"$f":"IF(D117=\"\",0,1)+IF(B120=\"\",0,1)+IF(B122=\"\",0,1)","v":3},{"$f":"IF(D117>B117,1,0)+IF(B120>D120,1,0)+IF(B122>D122,1,0)","v":0},{"$f":"IF(D117<B117,1,0)+IF(B120<D120,1,0)+IF(B122<D122,1,0)","v":3},{"$f":"IF(B117=\"\",0,IF(B117=D117,1,0))+IF(B120=\"\",0,IF(B120=D120,1,0))+IF(B122=\"\",0,IF(B122=D122,1,0))","v":0},{"$f":"IF(D117=\"\",0,+D117)+IF(B120=\"\",0,+B120)+IF(B122=\"\",0,+B122)","v":1},{"$f":"IF(B117=\"\",0,+B117)+IF(D120=\"\",0,+D120)+IF(D122=\"\",0,+D122)","v":13},{"$f":"L119-M119","v":-12},{"$f":"I119*3+K119","v":0},null,"Lazaros Papakonstantinou (GRE)",3,2,1,0,8,10,-2,6]
[{"$f":"$C6","v":"José David Somoza (ESP)"},{"$f":"IF('Séries individuels'!D147=\"\",\"\",'Séries individuels'!D147)","v":0},"-",{"$f":"IF('Séries individuels'!F147=\"\",\"\",'Séries individuels'!F147)","v":3},{"$f":"$E6","v":"Patrick Sheridan (USA)"},null,{"$f":"A118","v":"Lazaros Papakonstantinou (GRE)"},{"$f":"IF(B118=\"\",0,1)+IF(D119=\"\",0,1)+IF(D122=\"\",0,1)","v":3},{"$f":"IF(B118>D118,1,0)+IF(D119>B119,1,0)+IF(D122>B122,1,0)","v":2},{"$f":"IF(B118<D118,1,0)+IF(D119<B119,1,0)+IF(D122<B122,1,0)","v":1},{"$f":"IF(B118=\"\",0,IF(B118=D118,1,0))+IF(B119=\"\",0,IF(B119=D119,1,0))+IF(B122=\"\",0,IF(B122=D122,1,0))","v":0},{"$f":"IF(B118=\"\",0,+B118)+IF(D119=\"\",0,+D119)+IF(D122=\"\",0,+D122)","v":8},{"$f":"IF(D118=\"\",0,+D118)+IF(B119=\"\",0,+B119)+IF(B122=\"\",0,+B122)","v":10},{"$f":"L120-M120","v":-2},{"$f":"I120*3+K120","v":6},null,"Patrick Sheridan (USA)",3,1,2,0,6,13,-7,3]
[{"$f":"$E6","v":"Patrick Sheridan (USA)"},{"$f":"IF('Séries individuels'!D280=\"\",\"\",'Séries individuels'!D280)","v":2},"-",{"$f":"IF('Séries individuels'!F280=\"\",\"\",'Séries individuels'!F280)","v":10},{"$f":"$B6","v":"Daniele Bertelli (ITA)"},null,{"$f":"E118","v":"Patrick Sheridan (USA)"},{"$f":"IF(D118=\"\",0,1)+IF(D120=\"\",0,1)+IF(B121=\"\",0,1)","v":3},{"$f":"IF(D118>B118,1,0)+IF(D120>B120,1,0)+IF(B121>D121,1,0)","v":1},{"$f":"IF(D118<B118,1,0)+IF(D120<B120,1,0)+IF(B121<D121,1,0)","v":2},{"$f":"IF(B118=\"\",0,IF(B118=D118,1,0))+IF(B120=\"\",0,IF(B120=D120,1,0))+IF(B121=\"\",0,IF(B121=D121,1,0))","v":0},{"$f":"IF(D118=\"\",0,+D118)+IF(D120=\"\",0,+D120)+IF(B121=\"\",0,+B121)","v":6},{"$f":"IF(B118=\"\",0,+B118)+IF(B120=\"\",0,+B120)+IF(D121=\"\",0,+D121)","v":13},{"$f":"L121-M121","v":-7},{"$f":"I121*3+K121","v":3},null,"José David Somoza (ESP)",3,0,3,0,1,13,-12,0]
[{"$f":"$C6","v":"José David Somoza (ESP)"},{"$f":"IF('Séries individuels'!D281=\"\",\"\",'Séries individuels'!D281)","v":1},"-",{"$f":"IF('Séries individuels'!F281=\"\",\"\",'Séries individuels'!F281)","v":3},{"$f":"$D6","v":"Lazaros Papakonstantinou (GRE)"},null,null,null,{"$f":"SUM(I118:I121)","v":6},{"$f":"SUM(J118:J121)","v":6},{"$f":"SUM(K118:K121)","v":0},{"$f":"SUM(L118:L121)","v":40},{"$f":"SUM(M118:M121)","v":40},{"$f":"SUM(N118:N121)","v":0}]
[]
["Group 5"]
[]
[{"$f":"$B7","v":"Massimiliano Nastasi (ITA)"},{"$f":"IF('Séries individuels'!D14=\"\",\"\",'Séries individuels'!D14)","v":7},"-",{"$f":"IF('Séries individuels'!F14=\"\",\"\",'Séries individuels'!F14)","v":2},{"$f":"$C7","v":"Marcel Kwiatkowski (GER)"},null,null,"P","W","L","N","+","-","d","PTS",null,null,"P","W","L","N","+","-","d","PTS"]
[{"$f":"$D7","v":"Wolfgang Leitner (AUT)"},{"$f":"IF('Séries individuels'!D15=\"\",\"\",'Séries individuels'!D15)","v":1},"-",{"$f":"IF('Séries individuels'!F15=\"\",\"\",'Séries individuels'!F15)","v":0},{"$f":"$E7","v":"Giorgos Koutis (GRE)"},null,{"$f":"A126","v":"Massimiliano Nastasi (ITA)"},{"$f":"IF(B126=\"\",0,1)+IF(B128=\"\",0,1)+IF(D130=\"\",0,1)","v":3},{"$f":"IF(B126>D126,1,0)+IF(B128>D128,1,0)+IF(D130>B130,1,0)","v":1},{"$f":"IF(B126<D126,1,0)+IF(B128<D128,1,0)+IF(D130<B130,1,0)","v":2},{"$f":"IF(B126=\"\",0,IF(B126=D126,1,0))+IF(B128=\"\",0,IF(B128=D128,1,0))+IF(B130=\"\",0,IF(B130=D130,1,0))","v":0},{"$f":"IF(B126=\"\",0,+B126)+IF(B128=\"\",0,+B128)+IF(D130=\"\",0,+D130)","v":10},{"$f":"IF(D126=\"\",0,+D126)+IF(D128=\"\",0,+D128)+IF(B130=\"\",0,+B130)","v":8},{"$f":"L127-M127","v":2},{"$f":"I127*3+K127","v":3},null,"Wolfgang Leitner (AUT)",3,2,0,1,9,6,3,7]
[{"$f":"$B7","v":"Massimiliano Nastasi (ITA)"},{"$f":"IF('Séries individuels'!D148=\"\",\"\",'Séries individuels'!D148)","v":1},"-",{"$f":"IF('Séries individuels'!F148=\"\",\"\",'Séries individuels'!F148)","v":3},{"$f":"$D7","v":"Wolfgang Leitner (AUT)"},null,{"$f":"E126","v":"Marcel Kwiatkowski (GER)"},{"$f":"IF(D126=\"\",0,1)+IF(B129=\"\",0,1)+IF(B131=\"\",0,1)","v":3},{"$f":"IF(D126>B126,1,0)+IF(B129>D129,1,0)+IF(B131>D131,1,0)","v":0},{"$f":"IF(D126<B126,1,0)+IF(B129<D129,1,0)+IF(B131<D131,1,0)","v":2},{"$f":"IF(B126=\"\",0,IF(B126=D126,1,0))+IF(B129=\"\",0,IF(B129=D129,1,0))+IF(B131=\"\",0,IF(B131=D131,1,0))","v":1},{"$f":"IF(D126=\"\",0,+D126)+IF(B129=\"\",0,+B129)+IF(B131=\"\",0,+B131)","v":9},{"$f":"IF(B126=\"\",0,+B126)+IF(D129=\"\",0,+D129)+IF(D131=\"\",0,+D131)","v":16},{"$f":"L128-M128","v":-7},{"$f":"I128*3+K128","v":1},null,"Giorgos Koutis (GRE)",3,2,1,0,7,5,2,6]
[{"$f":"$C7","v":"Marcel Kwiatkowski (GER)"},{"$f":"IF('Séries individuels'!D149=\"\",\"\",'Séries individuels'!D149)","v":2},"-",{"$f":"IF('Séries individuels'!F149=\"\",\"\",'Séries individuels'!F149)","v":4},{"$f":"$E7","v":"Giorgos Koutis (GRE)"},null,{"$f":"A127","v":"Wolfgang Leitner (AUT)"},{"$f":"IF(B127=\"\",0,1)+IF(D128=\"\",0,1)+IF(D131=\"\",0,1)","v":3},{"$f":"IF(B127>D127,1,0)+IF(D128>B128,1,0)+IF(D131>B131,1,0)","v":2},{"$f":"IF(B127<D127,1,0)+IF(D128<B128,1,0)+IF(D131<B131,1,0)","v":0},{"$f":"IF(B127=\"\",0,IF(B127=D127,1,0))+IF(B128=\"\",0,IF(B128=D128,1,0))+IF(B131=\"\",0,IF(B131=D131,1,0))","v":1},{"$f":"IF(B127=\"\",0,+B127)+IF(D128=\"\",0,+D128)+IF(D131=\"\",0,+D131)","v":9},{"$f":"IF(D127=\"\",0,+D127)+IF(B128=\"\",0,+B128)+IF(B131=\"\",0,+B131)","v":6},{"$f":"L129-M129","v":3},{"$f":"I129*3+K129","v":7},null,"Massimiliano Nastasi (ITA)",3,1,2,0,10,8,2,3]
[{"$f":"$E7","v":"Giorgos Koutis (GRE)"},{"$f":"IF('Séries individuels'!D282=\"\",\"\",'Séries individuels'!D282)","v":3},"-",{"$f":"IF('Séries individuels'!F282=\"\",\"\",'Séries individuels'!F282)","v":2},{"$f":"$B7","v":"Massimiliano Nastasi (ITA)"},null,{"$f":"E127","v":"Giorgos Koutis (GRE)"},{"$f":"IF(D127=\"\",0,1)+IF(D129=\"\",0,1)+IF(B130=\"\",0,1)","v":3},{"$f":"IF(D127>B127,1,0)+IF(D129>B129,1,0)+IF(B130>D130,1,0)","v":2},{"$f":"IF(D127<B127,1,0)+IF(D129<B129,1,0)+IF(B130<D130,1,0)","v":1},{"$f":"IF(B127=\"\",0,IF(B127=D127,1,0))+IF(B129=\"\",0,IF(B129=D129,1,0))+IF(B130=\"\",0,IF(B130=D130,1,0))","v":0},{"$f":"IF(D127=\"\",0,+D127)+IF(D129=\"\",0,+D129)+IF(B130=\"\",0,+B130)","v":7},{"$f":"IF(B127=\"\",0,+B127)+IF(B129=\"\",0,+B129)+IF(D130=\"\",0,+D130)","v":5},{"$f":"L130-M130","v":2},{"$f":"I130*3+K130","v":6},null,"Marcel Kwiatkowski (GER)",3,0,2,1,9,16,-7,1]
[{"$f":"$C7","v":"Marcel Kwiatkowski (GER)"},{"$f":"IF('Séries individuels'!D283=\"\",\"\",'Séries individuels'!D283)","v":5},"-",{"$f":"IF('Séries individuels'!F283=\"\",\"\",'Séries individuels'!F283)","v":5},{"$f":"$D7","v":"Wolfgang Leitner (AUT)"},null,null,null,{"$f":"SUM(I127:I130)","v":5},{"$f":"SUM(J127:J130)","v":5},{"$f":"SUM(K127:K130)","v":2},{"$f":"SUM(L127:L130)","v":35},{"$f":"SUM(M127:M130)","v":35},{"$f":"SUM(N127:N130)","v":0}]
[]
["Group 6"]
[]
[{"$f":"$B8","v":"Christian Haas (AUT)"},{"$f":"IF('Séries individuels'!D16=\"\",\"\",'Séries individuels'!D16)","v":2},"-",{"$f":"IF('Séries individuels'!F16=\"\",\"\",'Séries individuels'!F16)","v":3},{"$f":"$C8","v":"Luca Zambello (ITA)"},null,null,"P","W","L","N","+","-","d","PTS",null,null,"P","W","L","N","+","-","d","PTS"]
[{"$f":"$D8","v":"Sami Targui (BEL)"},{"$f":"IF('Séries individuels'!D17=\"\",\"\",'Séries individuels'!D17)","v":1},"-",{"$f":"IF('Séries individuels'!F17=\"\",\"\",'Séries individuels'!F17)","v":1},{"$f":"$E8","v":"Jean-Marie Amberny (FRA)"},null,{"$f":"A135","v":"Christian Haas (AUT)"},{"$f":"IF(B135=\"\",0,1)+IF(B137=\"\",0,1)+IF(D139=\"\",0,1)","v":3},{"$f":"IF(B135>D135,1,0)+IF(B137>D137,1,0)+IF(D139>B139,1,0)","v":1},{"$f":"IF(B135<D135,1,0)+IF(B137<D137,1,0)+IF(D139<B139,1,0)","v":2},{"$f":"IF(B135=\"\",0,IF(B135=D135,1,0))+IF(B137=\"\",0,IF(B137=D137,1,0))+IF(B139=\"\",0,IF(B139=D139,1,0))","v":0},{"$f":"IF(B135=\"\",0,+B135)+IF(B137=\"\",0,+B137)+IF(D139=\"\",0,+D139)","v":6},{"$f":"IF(D135=\"\",0,+D135)+IF(D137=\"\",0,+D137)+IF(B139=\"\",0,+B139)","v":7},{"$f":"L136-M136","v":-1},{"$f":"I136*3+K136","v":3},null,"Sami Targui (BEL)",3,2,0,1,5,3,2,7]
[{"$f":"$B8","v":"Christian Haas (AUT)"},{"$f":"IF('Séries individuels'!D150=\"\",\"\",'Séries individuels'!D150)","v":1},"-",{"$f":"IF('Séries individuels'!F150=\"\",\"\",'Séries individuels'!F150)","v":2},{"$f":"$D8","v":"Sami Targui (BEL)"},null,{"$f":"E135","v":"Luca Zambello (ITA)"},{"$f":"IF(D135=\"\",0,1)+IF(B138=\"\",0,1)+IF(B140=\"\",0,1)","v":3},{"$f":"IF(D135>B135,1,0)+IF(B138>D138,1,0)+IF(B140>D140,1,0)","v":2},{"$f":"IF(D135<B135,1,0)+IF(B138<D138,1,0)+IF(B140<D140,1,0)","v":1},{"$f":"IF(B135=\"\",0,IF(B135=D135,1,0))+IF(B138=\"\",0,IF(B138=D138,1,0))+IF(B140=\"\",0,IF(B140=D140,1,0))","v":0},{"$f":"IF(D135=\"\",0,+D135)+IF(B138=\"\",0,+B138)+IF(B140=\"\",0,+B140)","v":7},{"$f":"IF(B135=\"\",0,+B135)+IF(D138=\"\",0,+D138)+IF(D140=\"\",0,+D140)","v":6},{"$f":"L137-M137","v":1},{"$f":"I137*3+K137","v":6},null,"Luca Zambello (ITA)",3,2,1,0,7,6,1,6]
[{"$f":"$C8","v":"Luca Zambello (ITA)"},{"$f":"IF('Séries individuels'!D151=\"\",\"\",'Séries individuels'!D151)","v":3},"-",{"$f":"IF('Séries individuels'!F151=\"\",\"\",'Séries individuels'!F151)","v":2},{"$f":"$E8","v":"Jean-Marie Amberny (FRA)"},null,{"$f":"A136","v":"Sami Targui (BEL)"},{"$f":"IF(B136=\"\",0,1)+IF(D137=\"\",0,1)+IF(D140=\"\",0,1)","v":3},{"$f":"IF(B136>D136,1,0)+IF(D137>B137,1,0)+IF(D140>B140,1,0)","v":2},{"$f":"IF(B136<D136,1,0)+IF(D137<B137,1,0)+IF(D140<B140,1,0)","v":0},{"$f":"IF(B136=\"\",0,IF(B136=D136,1,0))+IF(B137=\"\",0,IF(B137=D137,1,0))+IF(B140=\"\",0,IF(B140=D140,1,0))","v":1},{"$f":"IF(B136=\"\",0,+B136)+IF(D137=\"\",0,+D137)+IF(D140=\"\",0,+D140)","v":5},{"$f":"IF(D136=\"\",0,+D136)+IF(B137=\"\",0,+B137)+IF(B140=\"\",0,+B140)","v":3},{"$f":"L138-M138","v":2},{"$f":"I138*3+K138","v":7},null,"Christian Haas (AUT)",3,1,2,0,6,7,-1,3]
[{"$f":"$E8","v":"Jean-Marie Amberny (FRA)"},{"$f":"IF('Séries individuels'!D284=\"\",\"\",'Séries individuels'!D284)","v":2},"-",{"$f":"IF('Séries individuels'!F284=\"\",\"\",'Séries individuels'!F284)","v":3},{"$f":"$B8","v":"Christian Haas (AUT)"},null,{"$f":"E136","v":"Jean-Marie Amberny (FRA)"},{"$f":"IF(D136=\"\",0,1)+IF(D138=\"\",0,1)+IF(B139=\"\",0,1)","v":3},{"$f":"IF(D136>B136,1,0)+IF(D138>B138,1,0)+IF(B139>D139,1,0)","v":0},{"$f":"IF(D136<B136,1,0)+IF(D138<B138,1,0)+IF(B139<D139,1,0)","v":2},{"$f":"IF(B136=\"\",0,IF(B136=D136,1,0))+IF(B138=\"\",0,IF(B138=D138,1,0))+IF(B139=\"\",0,IF(B139=D139,1,0))","v":1},{"$f":"IF(D136=\"\",0,+D136)+IF(D138=\"\",0,+D138)+IF(B139=\"\",0,+B139)","v":5},{"$f":"IF(B136=\"\",0,+B136)+IF(B138=\"\",0,+B138)+IF(D139=\"\",0,+D139)","v":7},{"$f":"L139-M139","v":-2},{"$f":"I139*3+K139","v":1},null,"Jean-Marie Amberny (FRA)",3,0,2,1,5,7,-2,1]
[{"$f":"$C8","v":"Luca Zambello (ITA)"},{"$f":"IF('Séries individuels'!D285=\"\",\"\",'Séries individuels'!D285)","v":1},"-",{"$f":"IF('Séries individuels'!F285=\"\",\"\",'Séries individuels'!F285)","v":2},{"$f":"$D8","v":"Sami Targui (BEL)"},null,null,null,{"$f":"SUM(I136:I139)","v":5},{"$f":"SUM(J136:J139)","v":5},{"$f":"SUM(K136:K139)","v":2},{"$f":"SUM(L136:L139)","v":23},{"$f":"SUM(M136:M139)","v":23},{"$f":"SUM(N136:N139)","v":0}]
[]
["Group 7"]
[]
[{"$f":"$B9","v":"Spyros Hatzaras (GRE)"},{"$f":"IF('Séries individuels'!D18=\"\",\"\",'Séries individuels'!D18)","v":3},"-",{"$f":"IF('Séries individuels'!F18=\"\",\"\",'Séries individuels'!F18)","v":2},{"$f":"$C9","v":"Alexander Ruf (GER)"},null,null,"P","W","L","N","+","-","d","PTS",null,null,"P","W","L","N","+","-","d","PTS"]
[{"$f":"$D9","v":"Fayçal Rouis (FRA)"},{"$f":"IF('Séries individuels'!D19=\"\",\"\",'Séries individuels'!D19)","v":2},"-",{"$f":"IF('Séries individuels'!F19=\"\",\"\",'Séries individuels'!F19)","v":0},{"$f":"$E9","v":"Thomas Wittmann (AUT)"},null,{"$f":"A144","v":"Spyros Hatzaras (GRE)"},{"$f":"IF(B144=\"\",0,1)+IF(B146=\"\",0,1)+IF(D148=\"\",0,1)","v":3},{"$f":"IF(B144>D144,1,0)+IF(B146>D146,1,0)+IF(D148>B148,1,0)","v":2},{"$f":"IF(B144<D144,1,0)+IF(B146<D146,1,0)+IF(D148<B148,1,0)","v":0},{"$f":"IF(B144=\"\",0,IF(B144=D144,1,0))+IF(B146=\"\",0,IF(B146=D146,1,0))+IF(B148=\"\",0,IF(B148=D148,1,0))","v":1},{"$f":"IF(B144=\"\",0,+B144)+IF(B146=\"\",0,+B146)+IF(D148=\"\",0,+D148)","v":6},{"$f":"IF(D144=\"\",0,+D144)+IF(D146=\"\",0,+D146)+IF(B148=\"\",0,+B148)","v":3},{"$f":"L145-M145","v":3},{"$f":"I145*3+K145","v":7},null,"Spyros Hatzaras (GRE)",3,2,0,1,6,3,3,7]
[{"$f":"$B9","v":"Spyros Hatzaras (GRE)"},{"$f":"IF('Séries individuels'!D152=\"\",\"\",'Séries individuels'!D152)","v":3},"-",{"$f":"IF('Séries individuels'!F152=\"\",\"\",'Séries individuels'!F152)","v":1},{"$f":"$D9","v":"Fayçal Rouis (FRA)"},null,{"$f":"E144","v":"Alexander Ruf (GER)"},{"$f":"IF(D144=\"\",0,1)+IF(B147=\"\",0,1)+IF(B149=\"\",0,1)","v":3},{"$f":"IF(D144>B144,1,0)+IF(B147>D147,1,0)+IF(B149>D149,1,0)","v":1},{"$f":"IF(D144<B144,1,0)+IF(B147<D147,1,0)+IF(B149<D149,1,0)","v":1},{"$f":"IF(B144=\"\",0,IF(B144=D144,1,0))+IF(B147=\"\",0,IF(B147=D147,1,0))+IF(B149=\"\",0,IF(B149=D149,1,0))","v":1},{"$f":"IF(D144=\"\",0,+D144)+IF(B147=\"\",0,+B147)+IF(B149=\"\",0,+B149)","v":5},{"$f":"IF(B144=\"\",0,+B144)+IF(D147=\"\",0,+D147)+IF(D149=\"\",0,+D149)","v":3},{"$f":"L146-M146","v":2},{"$f":"I146*3+K146","v":4},null,"Alexander Ruf (GER)",3,1,1,1,5,3,2,4]
[{"$f":"$C9","v":"Alexander Ruf (GER)"},{"$f":"IF('Séries individuels'!D153=\"\",\"\",'Séries individuels'!D153)","v":3},"-",{"$f":"IF('Séries individuels'!F153=\"\",\"\",'Séries individuels'!F153)","v":0},{"$f":"$E9","v":"Thomas Wittmann (AUT)"},null,{"$f":"A145","v":"Fayçal Rouis (FRA)"},{"$f":"IF(B145=\"\",0,1)+IF(D146=\"\",0,1)+IF(D149=\"\",0,1)","v":3},{"$f":"IF(B145>D145,1,0)+IF(D146>B146,1,0)+IF(D149>B149,1,0)","v":1},{"$f":"IF(B145<D145,1,0)+IF(D146<B146,1,0)+IF(D149<B149,1,0)","v":1},{"$f":"IF(B145=\"\",0,IF(B145=D145,1,0))+IF(B146=\"\",0,IF(B146=D146,1,0))+IF(B149=\"\",0,IF(B149=D149,1,0))","v":1},{"$f":"IF(B145=\"\",0,+B145)+IF(D146=\"\",0,+D146)+IF(D149=\"\",0,+D149)","v":3},{"$f":"IF(D145=\"\",0,+D145)+IF(B146=\"\",0,+B146)+IF(B149=\"\",0,+B149)","v":3},{"$f":"L147-M147","v":0},{"$f":"I147*3+K147","v":4},null,"Fayçal Rouis (FRA)",3,1,1,1,3,3,0,4]
[{"$f":"$E9","v":"Thomas Wittmann (AUT)"},{"$f":"IF('Séries individuels'!D286=\"\",\"\",'Séries individuels'!D286)","v":0},"-",{"$f":"IF('Séries individuels'!F286=\"\",\"\",'Séries individuels'!F286)","v":0},{"$f":"$B9","v":"Spyros Hatzaras (GRE)"},null,{"$f":"E145","v":"Thomas Wittmann (AUT)"},{"$f":"IF(D145=\"\",0,1)+IF(D147=\"\",0,1)+IF(B148=\"\",0,1)","v":3},{"$f":"IF(D145>B145,1,0)+IF(D147>B147,1,0)+IF(B148>D148,1,0)","v":0},{"$f":"IF(D145<B145,1,0)+IF(D147<B147,1,0)+IF(B148<D148,1,0)","v":2},{"$f":"IF(B145=\"\",0,IF(B145=D145,1,0))+IF(B147=\"\",0,IF(B147=D147,1,0))+IF(B148=\"\",0,IF(B148=D148,1,0))","v":1},{"$f":"IF(D145=\"\",0,+D145)+IF(D147=\"\",0,+D147)+IF(B148=\"\",0,+B148)","v":0},{"$f":"IF(B145=\"\",0,+B145)+IF(B147=\"\",0,+B147)+IF(D148=\"\",0,+D148)","v":5},{"$f":"L148-M148","v":-5},{"$f":"I148*3+K148","v":1},null,"Thomas Wittmann (AUT)",3,0,2,1,0,5,-5,1]
[{"$f":"$C9","v":"Alexander Ruf (GER)"},{"$f":"IF('Séries individuels'!D287=\"\",\"\",'Séries individuels'!D287)","v":0},"-",{"$f":"IF('Séries individuels'!F287=\"\",\"\",'Séries individuels'!F287)","v":0},{"$f":"$D9","v":"Fayçal Rouis (FRA)"},null,null,null,{"$f":"SUM(I145:I148)","v":4},{"$f":"SUM(J145:J148)","v":4},{"$f":"SUM(K145:K148)","v":4},{"$f":"SUM(L145:L148)","v":14},{"$f":"SUM(M145:M148)","v":14},{"$f":"SUM(N145:N148)","v":0}]
[]
["Group 8"]
[]
[{"$f":"$B10","v":"Alexander Haas (AUT)"},{"$f":"IF('Séries individuels'!D20=\"\",\"\",'Séries individuels'!D20)","v":3},"-",{"$f":"IF('Séries individuels'!F20=\"\",\"\",'Séries individuels'!F20)","v":1},{"$f":"$C10","v":"Valéry Dejardin (BEL)"},null,null,"P","W","L","N","+","-","d","PTS",null,null,"P","W","L","N","+","-","d","PTS"]
[{"$f":"$D10","v":"Frank Hagenkötter (GER)"},{"$f":"IF('Séries individuels'!D21=\"\",\"\",'Séries individuels'!D21)","v":2},"-",{"$f":"IF('Séries individuels'!F21=\"\",\"\",'Séries individuels'!F21)","v":4},{"$f":"$E10","v":"Romain Lafontaine (FRA)"},null,{"$f":"A153","v":"Alexander Haas (AUT)"},{"$f":"IF(B153=\"\",0,1)+IF(B155=\"\",0,1)+IF(D157=\"\",0,1)","v":3},{"$f":"IF(B153>D153,1,0)+IF(B155>D155,1,0)+IF(D157>B157,1,0)","v":2},{"$f":"IF(B153<D153,1,0)+IF(B155<D155,1,0)+IF(D157<B157,1,0)","v":0},{"$f":"IF(B153=\"\",0,IF(B153=D153,1,0))+IF(B155=\"\",0,IF(B155=D155,1,0))+IF(B157=\"\",0,IF(B157=D157,1,0))","v":1},{"$f":"IF(B153=\"\",0,+B153)+IF(B155=\"\",0,+B155)+IF(D157=\"\",0,+D157)","v":10},{"$f":"IF(D153=\"\",0,+D153)+IF(D155=\"\",0,+D155)+IF(B157=\"\",0,+B157)","v":6},{"$f":"L154-M154","v":4},{"$f":"I154*3+K154","v":7},null,"Alexander Haas (AUT)",3,2,0,1,10,6,4,7]
[{"$f":"$B10","v":"Alexander Haas (AUT)"},{"$f":"IF('Séries individuels'!D154=\"\",\"\",'Séries individuels'!D154)","v":5},"-",{"$f":"IF('Séries individuels'!F154=\"\",\"\",'Séries individuels'!F154)","v":3},{"$f":"$D10","v":"Frank Hagenkötter (GER)"},null,{"$f":"E153","v":"Valéry Dejardin (BEL)"},{"$f":"IF(D153=\"\",0,1)+IF(B156=\"\",0,1)+IF(B158=\"\",0,1)","v":3},{"$f":"IF(D153>B153,1,0)+IF(B156>D156,1,0)+IF(B158>D158,1,0)","v":2},{"$f":"IF(D153<B153,1,0)+IF(B156<D156,1,0)+IF(B158<D158,1,0)","v":1},{"$f":"IF(B153=\"\",0,IF(B153=D153,1,0))+IF(B156=\"\",0,IF(B156=D156,1,0))+IF(B158=\"\",0,IF(B158=D158,1,0))","v":0},{"$f":"IF(D153=\"\",0,+D153)+IF(B156=\"\",0,+B156)+IF(B158=\"\",0,+B158)","v":7},{"$f":"IF(B153=\"\",0,+B153)+IF(D156=\"\",0,+D156)+IF(D158=\"\",0,+D158)","v":5},{"$f":"L155-M155","v":2},{"$f":"I155*3+K155","v":6},null,"Valéry Dejardin (BEL)",3,2,1,0,7,5,2,6]
[{"$f":"$C10","v":"Valéry Dejardin (BEL)"},{"$f":"IF('Séries individuels'!D155=\"\",\"\",'Séries individuels'!D155)","v":2},"-",{"$f":"IF('Séries individuels'!F155=\"\",\"\",'Séries individuels'!F155)","v":1},{"$f":"$E10","v":"Romain Lafontaine (FRA)"},null,{"$f":"A154","v":"Frank Hagenkötter (GER)"},{"$f":"IF(B154=\"\",0,1)+IF(D155=\"\",0,1)+IF(D158=\"\",0,1)","v":3},{"$f":"IF(B154>D154,1,0)+IF(D155>B155,1,0)+IF(D158>B158,1,0)","v":0},{"$f":"IF(B154<D154,1,0)+IF(D155<B155,1,0)+IF(D158<B158,1,0)","v":3},{"$f":"IF(B154=\"\",0,IF(B154=D154,1,0))+IF(B155=\"\",0,IF(B155=D155,1,0))+IF(B158=\"\",0,IF(B158=D158,1,0))","v":0},{"$f":"IF(B154=\"\",0,+B154)+IF(D155=\"\",0,+D155)+IF(D158=\"\",0,+D158)","v":6},{"$f":"IF(D154=\"\",0,+D154)+IF(B155=\"\",0,+B155)+IF(B158=\"\",0,+B158)","v":13},{"$f":"L156-M156","v":-7},{"$f":"I156*3+K156","v":0},null,"Romain Lafontaine (FRA)",3,1,1,1,7,6,1,4]
[{"$f":"$E10","v":"Romain Lafontaine (FRA)"},{"$f":"IF('Séries individuels'!D288=\"\",\"\",'Séries individuels'!D288)","v":2},"-",{"$f":"IF('Séries individuels'!F288=\"\",\"\",'Séries individuels'!F288)","v":2},{"$f":"$B10","v":"Alexander Haas (AUT)"},null,{"$f":"E154","v":"Romain Lafontaine (FRA)"},{"$f":"IF(D154=\"\",0,1)+IF(D156=\"\",0,1)+IF(B157=\"\",0,1)","v":3},{"$f":"IF(D154>B154,1,0)+IF(D156>B156,1,0)+IF(B157>D157,1,0)","v":1},{"$f":"IF(D154<B154,1,0)+IF(D156<B156,1,0)+IF(B157<D157,1,0)","v":1},{"$f":"IF(B154=\"\",0,IF(B154=D154,1,0))+IF(B156=\"\",0,IF(B156=D156,1,0))+IF(B157=\"\",0,IF(B157=D157,1,0))","v":1},{"$f":"IF(D154=\"\",0,+D154)+IF(D156=\"\",0,+D156)+IF(B157=\"\",0,+B157)","v":7},{"$f":"IF(B154=\"\",0,+B154)+IF(B156=\"\",0,+B156)+IF(D157=\"\",0,+D157)","v":6},{"$f":"L157-M157","v":1},{"$f":"I157*3+K157","v":4},null,"Frank Hagenkötter (GER)",3,0,3,0,6,13,-7,0]
[{"$f":"$C10","v":"Valéry Dejardin (BEL)"},{"$f":"IF('Séries individuels'!D289=\"\",\"\",'Séries individuels'!D289)","v":4},"-",{"$f":"IF('Séries individuels'!F289=\"\",\"\",'Séries individuels'!F289)","v":1},{"$f":"$D10","v":"Frank Hagenkötter (GER)"},null,null,null,{"$f":"SUM(I154:I157)","v":5},{"$f":"SUM(J154:J157)","v":5},{"$f":"SUM(K154:K157)","v":2},{"$f":"SUM(L154:L157)","v":30},{"$f":"SUM(M154:M157)","v":30},{"$f":"SUM(N154:N157)","v":0}]
[]
["Group 9"]
[]
[{"$f":"$B11","v":"Sébastien Scheen (BEL)"},{"$f":"IF('Séries individuels'!D73=\"\",\"\",'Séries individuels'!D73)","v":5},"-",{"$f":"IF('Séries individuels'!F73=\"\",\"\",'Séries individuels'!F73)","v":4},{"$f":"$C11","v":"Heinz Eder (AUT)"},null,null,"P","W","L","N","+","-","d","PTS",null,null,"P","W","L","N","+","-","d","PTS"]
[{"$f":"$D11","v":"Julio Candélas (ESP)"},{"$f":"IF('Séries individuels'!D74=\"\",\"\",'Séries individuels'!D74)","v":0},"-",{"$f":"IF('Séries individuels'!F74=\"\",\"\",'Séries individuels'!F74)","v":5},{"$f":"$E11","v":"Velissarios Fragakis (GRE)"},null,{"$f":"A162","v":"Sébastien Scheen (BEL)"},{"$f":"IF(B162=\"\",0,1)+IF(B164=\"\",0,1)+IF(D166=\"\",0,1)","v":3},{"$f":"IF(B162>D162,1,0)+IF(B164>D164,1,0)+IF(D166>B166,1,0)","v":2},{"$f":"IF(B162<D162,1,0)+IF(B164<D164,1,0)+IF(D166<B166,1,0)","v":0},{"$f":"IF(B162=\"\",0,IF(B162=D162,1,0))+IF(B164=\"\",0,IF(B164=D164,1,0))+IF(B166=\"\",0,IF(B166=D166,1,0))","v":1},{"$f":"IF(B162=\"\",0,+B162)+IF(B164=\"\",0,+B164)+IF(D166=\"\",0,+D166)","v":14},{"$f":"IF(D162=\"\",0,+D162)+IF(D164=\"\",0,+D164)+IF(B166=\"\",0,+B166)","v":7},{"$f":"L163-M163","v":7},{"$f":"I163*3+K163","v":7},null,"Sébastien Scheen (BEL)",3,2,0,1,14,7,7,7]
[{"$f":"$B11","v":"Sébastien Scheen (BEL)"},{"$f":"IF('Séries individuels'!D207=\"\",\"\",'Séries individuels'!D207)","v":6},"-",{"$f":"IF('Séries individuels'!F207=\"\",\"\",'Séries individuels'!F207)","v":0},{"$f":"$D11","v":"Julio Candélas (ESP)"},null,{"$f":"E162","v":"Heinz Eder (AUT)"},{"$f":"IF(D162=\"\",0,1)+IF(B165=\"\",0,1)+IF(B167=\"\",0,1)","v":3},{"$f":"IF(D162>B162,1,0)+IF(B165>D165,1,0)+IF(B167>D167,1,0)","v":2},{"$f":"IF(D162<B162,1,0)+IF(B165<D165,1,0)+IF(B167<D167,1,0)","v":1},{"$f":"IF(B162=\"\",0,IF(B162=D162,1,0))+IF(B165=\"\",0,IF(B165=D165,1,0))+IF(B167=\"\",0,IF(B167=D167,1,0))","v":0},{"$f":"IF(D162=\"\",0,+D162)+IF(B165=\"\",0,+B165)+IF(B167=\"\",0,+B167)","v":12},{"$f":"IF(B162=\"\",0,+B162)+IF(D165=\"\",0,+D165)+IF(D167=\"\",0,+D167)","v":7},{"$f":"L164-M164","v":5},{"$f":"I164*3+K164","v":6},null,"Heinz Eder (AUT)",3,2,1,0,12,7,5,6]
[{"$f":"$C11","v":"Heinz Eder (AUT)"},{"$f":"IF('Séries individuels'!D208=\"\",\"\",'Séries individuels'!D208)","v":5},"-",{"$f":"IF('Séries individuels'!F208=\"\",\"\",'Séries individuels'!F208)","v":1},{"$f":"$E11","v":"Velissarios Fragakis (GRE)"},null,{"$f":"A163","v":"Julio Candélas (ESP)"},{"$f":"IF(B163=\"\",0,1)+IF(D164=\"\",0,1)+IF(D167=\"\",0,1)","v":3},{"$f":"IF(B163>D163,1,0)+IF(D164>B164,1,0)+IF(D167>B167,1,0)","v":0},{"$f":"IF(B163<D163,1,0)+IF(D164<B164,1,0)+IF(D167<B167,1,0)","v":3},{"$f":"IF(B163=\"\",0,IF(B163=D163,1,0))+IF(B164=\"\",0,IF(B164=D164,1,0))+IF(B167=\"\",0,IF(B167=D167,1,0))","v":0},{"$f":"IF(B163=\"\",0,+B163)+IF(D164=\"\",0,+D164)+IF(D167=\"\",0,+D167)","v":1},{"$f":"IF(D163=\"\",0,+D163)+IF(B164=\"\",0,+B164)+IF(B167=\"\",0,+B167)","v":14},{"$f":"L165-M165","v":-13},{"$f":"I165*3+K165","v":0},null,"Velissarios Fragakis (GRE)",3,1,1,1,9,8,1,4]
[{"$f":"$E11","v":"Velissarios Fragakis (GRE)"},{"$f":"IF('Séries individuels'!D341=\"\",\"\",'Séries individuels'!D341)","v":3},"-",{"$f":"IF('Séries individuels'!F341=\"\",\"\",'Séries individuels'!F341)","v":3},{"$f":"$B11","v":"Sébastien Scheen (BEL)"},null,{"$f":"E163","v":"Velissarios Fragakis (GRE)"},{"$f":"IF(D163=\"\",0,1)+IF(D165=\"\",0,1)+IF(B166=\"\",0,1)","v":3},{"$f":"IF(D163>B163,1,0)+IF(D165>B165,1,0)+IF(B166>D166,1,0)","v":1},{"$f":"IF(D163<B163,1,0)+IF(D165<B165,1,0)+IF(B166<D166,1,0)","v":1},{"$f":"IF(B163=\"\",0,IF(B163=D163,1,0))+IF(B165=\"\",0,IF(B165=D165,1,0))+IF(B166=\"\",0,IF(B166=D166,1,0))","v":1},{"$f":"IF(D163=\"\",0,+D163)+IF(D165=\"\",0,+D165)+IF(B166=\"\",0,+B166)","v":9},{"$f":"IF(B163=\"\",0,+B163)+IF(B165=\"\",0,+B165)+IF(D166=\"\",0,+D166)","v":8},{"$f":"L166-M166","v":1},{"$f":"I166*3+K166","v":4},null,"Julio Candélas (ESP)",3,0,3,0,1,14,-13,0]
[{"$f":"$C11","v":"Heinz Eder (AUT)"},{"$f":"IF('Séries individuels'!D342=\"\",\"\",'Séries individuels'!D342)","v":3},"-",{"$f":"IF('Séries individuels'!F342=\"\",\"\",'Séries individuels'!F342)","v":1},{"$f":"$D11","v":"Julio Candélas (ESP)"},null,null,null,{"$f":"SUM(I163:I166)","v":5},{"$f":"SUM(J163:J166)","v":5},{"$f":"SUM(K163:K166)","v":2},{"$f":"SUM(L163:L166)","v":36},{"$f":"SUM(M163:M166)","v":36},{"$f":"SUM(N163:N166)","v":0}]
[]
["Group 10"]
[]
[{"$f":"$B12","v":"Justin Leroy (BEL)"},{"$f":"IF('Séries individuels'!D75=\"\",\"\",'Séries individuels'!D75)","v":8},"-",{"$f":"IF('Séries individuels'!F75=\"\",\"\",'Séries individuels'!F75)","v":1},{"$f":"$C12","v":"Marcus Tilgner (GER)"},null,null,"P","W","L","N","+","-","d","PTS",null,null,"P","W","L","N","+","-","d","PTS"]
[{"$f":"$D12","v":"Juan Carlos Pinto (ESP)"},{"$f":"IF('Séries individuels'!D76=\"\",\"\",'Séries individuels'!D76)","v":0},"-",{"$f":"IF('Séries individuels'!F76=\"\",\"\",'Séries individuels'!F76)","v":6},{"$f":"$E12","v":"Massimo Bolognino (ITA)"},null,{"$f":"A171","v":"Justin Leroy (BEL)"},{"$f":"IF(B171=\"\",0,1)+IF(B173=\"\",0,1)+IF(D175=\"\",0,1)","v":3},{"$f":"IF(B171>D171,1,0)+IF(B173>D173,1,0)+IF(D175>B175,1,0)","v":2},{"$f":"IF(B171<D171,1,0)+IF(B173<D173,1,0)+IF(D175<B175,1,0)","v":1},{"$f":"IF(B171=\"\",0,IF(B171=D171,1,0))+IF(B173=\"\",0,IF(B173=D173,1,0))+IF(B175=\"\",0,IF(B175=D175,1,0))","v":0},{"$f":"IF(B171=\"\",0,+B171)+IF(B173=\"\",0,+B173)+IF(D175=\"\",0,+D175)","v":15},{"$f":"IF(D171=\"\",0,+D171)+IF(D173=\"\",0,+D173)+IF(B175=\"\",0,+B175)","v":3},{"$f":"L172-M172","v":12},{"$f":"I172*3+K172","v":6},null,"Massimo Bolognino (ITA)",3,3,0,0,14,3,11,9]
[{"$f":"$B12","v":"Justin Leroy (BEL)"},{"$f":"IF('Séries individuels'!D209=\"\",\"\",'Séries individuels'!D209)","v":6},"-",{"$f":"IF('Séries individuels'!F209=\"\",\"\",'Séries individuels'!F209)","v":0},{"$f":"$D12","v":"Juan Carlos Pinto (ESP)"},null,{"$f":"E171","v":"Marcus Tilgner (GER)"},{"$f":"IF(D171=\"\",0,1)+IF(B174=\"\",0,1)+IF(B176=\"\",0,1)","v":3},{"$f":"IF(D171>B171,1,0)+IF(B174>D174,1,0)+IF(B176>D176,1,0)","v":1},{"$f":"IF(D171<B171,1,0)+IF(B174<D174,1,0)+IF(B176<D176,1,0)","v":2},{"$f":"IF(B171=\"\",0,IF(B171=D171,1,0))+IF(B174=\"\",0,IF(B174=D174,1,0))+IF(B176=\"\",0,IF(B176=D176,1,0))","v":0},{"$f":"IF(D171=\"\",0,+D171)+IF(B174=\"\",0,+B174)+IF(B176=\"\",0,+B176)","v":11},{"$f":"IF(B171=\"\",0,+B171)+IF(D174=\"\",0,+D174)+IF(D176=\"\",0,+D176)","v":15},{"$f":"L173-M173","v":-4},{"$f":"I173*3+K173","v":3},null,"Justin Leroy (BEL)",3,2,1,0,15,3,12,6]
[{"$f":"$C12","v":"Marcus Tilgner (GER)"},{"$f":"IF('Séries individuels'!D210=\"\",\"\",'Séries individuels'!D210)","v":2},"-",{"$f":"IF('Séries individuels'!F210=\"\",\"\",'Séries individuels'!F210)","v":6},{"$f":"$E12","v":"Massimo Bolognino (ITA)"},null,{"$f":"A172","v":"Juan Carlos Pinto (ESP)"},{"$f":"IF(B172=\"\",0,1)+IF(D173=\"\",0,1)+IF(D176=\"\",0,1)","v":3},{"$f":"IF(B172>D172,1,0)+IF(D173>B173,1,0)+IF(D176>B176,1,0)","v":0},{"$f":"IF(B172<D172,1,0)+IF(D173<B173,1,0)+IF(D176<B176,1,0)","v":3},{"$f":"IF(B172=\"\",0,IF(B172=D172,1,0))+IF(B173=\"\",0,IF(B173=D173,1,0))+IF(B176=\"\",0,IF(B176=D176,1,0))","v":0},{"$f":"IF(B172=\"\",0,+B172)+IF(D173=\"\",0,+D173)+IF(D176=\"\",0,+D176)","v":1},{"$f":"IF(D172=\"\",0,+D172)+IF(B173=\"\",0,+B173)+IF(B176=\"\",0,+B176)","v":20},{"$f":"L174-M174","v":-19},{"$f":"I174*3+K174","v":0},null,"Marcus Tilgner (GER)",3,1,2,0,11,15,-4,3]
[{"$f":"$E12","v":"Massimo Bolognino (ITA)"},{"$f":"IF('Séries individuels'!D343=\"\",\"\",'Séries individuels'!D343)","v":2},"-",{"$f":"IF('Séries individuels'!F343=\"\",\"\",'Séries individuels'!F343)","v":1},{"$f":"$B12","v":"Justin Leroy (BEL)"},null,{"$f":"E172","v":"Massimo Bolognino (ITA)"},{"$f":"IF(D172=\"\",0,1)+IF(D174=\"\",0,1)+IF(B175=\"\",0,1)","v":3},{"$f":"IF(D172>B172,1,0)+IF(D174>B174,1,0)+IF(B175>D175,1,0)","v":3},{"$f":"IF(D172<B172,1,0)+IF(D174<B174,1,0)+IF(B175<D175,1,0)","v":0},{"$f":"IF(B172=\"\",0,IF(B172=D172,1,0))+IF(B174=\"\",0,IF(B174=D174,1,0))+IF(B175=\"\",0,IF(B175=D175,1,0))","v":0},{"$f":"IF(D172=\"\",0,+D172)+IF(D174=\"\",0,+D174)+IF(B175=\"\",0,+B175)","v":14},{"$f":"IF(B172=\"\",0,+B172)+IF(B174=\"\",0,+B174)+IF(D175=\"\",0,+D175)","v":3},{"$f":"L175-M175","v":11},{"$f":"I175*3+K175","v":9},null,"Juan Carlos Pinto (ESP)",3,0,3,0,1,20,-19,0]
[{"$f":"$C12","v":"Marcus Tilgner (GER)"},{"$f":"IF('Séries individuels'!D344=\"\",\"\",'Séries individuels'!D344)","v":8},"-",{"$f":"IF('Séries individuels'!F344=\"\",\"\",'Séries individuels'!F344)","v":1},{"$f":"$D12","v":"Juan Carlos Pinto (ESP)"},null,null,null,{"$f":"SUM(I172:I175)","v":6},{"$f":"SUM(J172:J175)","v":6},{"$f":"SUM(K172:K175)","v":0},{"$f":"SUM(L172:L175)","v":41},{"$f":"SUM(M172:M175)","v":41},{"$f":"SUM(N172:N175)","v":0}]
[]
["Group 11"]
[]
[{"$f":"$B13","v":"Christophe Dheur (BEL)"},{"$f":"IF('Séries individuels'!D77=\"\",\"\",'Séries individuels'!D77)","v":8},"-",{"$f":"IF('Séries individuels'!F77=\"\",\"\",'Séries individuels'!F77)","v":0},{"$f":"$C13","v":"Jonathan Dotto (GIB)"},null,null,"P","W","L","N","+","-","d","PTS",null,null,"P","W","L","N","+","-","d","PTS"]
[{"$f":"$D13","v":"Kostas Stamokostas (GRE)"},{"$f":"IF('Séries individuels'!D78=\"\",\"\",'Séries individuels'!D78)","v":4},"-",{"$f":"IF('Séries individuels'!F78=\"\",\"\",'Séries individuels'!F78)","v":0},{"$f":"$E13","v":"Raffaele Lombardi (AUS)"},null,{"$f":"A180","v":"Christophe Dheur (BEL)"},{"$f":"IF(B180=\"\",0,1)+IF(B182=\"\",0,1)+IF(D184=\"\",0,1)","v":3},{"$f":"IF(B180>D180,1,0)+IF(B182>D182,1,0)+IF(D184>B184,1,0)","v":3},{"$f":"IF(B180<D180,1,0)+IF(B182<D182,1,0)+IF(D184<B184,1,0)","v":0},{"$f":"IF(B180=\"\",0,IF(B180=D180,1,0))+IF(B182=\"\",0,IF(B182=D182,1,0))+IF(B184=\"\",0,IF(B184=D184,1,0))","v":0},{"$f":"IF(B180=\"\",0,+B180)+IF(B182=\"\",0,+B182)+IF(D184=\"\",0,+D184)","v":19},{"$f":"IF(D180=\"\",0,+D180)+IF(D182=\"\",0,+D182)+IF(B184=\"\",0,+B184)","v":2},{"$f":"L181-M181","v":17},{"$f":"I181*3+K181","v":9},null,"Christophe Dheur (BEL)",3,3,0,0,19,2,17,9]
[{"$f":"$B13","v":"Christophe Dheur (BEL)"},{"$f":"IF('Séries individuels'!D211=\"\",\"\",'Séries individuels'!D211)","v":5},"-",{"$f":"IF('Séries individuels'!F211=\"\",\"\",'Séries individuels'!F211)","v":1},{"$f":"$D13","v":"Kostas Stamokostas (GRE)"},null,{"$f":"E180","v":"Jonathan Dotto (GIB)"},{"$f":"IF(D180=\"\",0,1)+IF(B183=\"\",0,1)+IF(B185=\"\",0,1)","v":3},{"$f":"IF(D180>B180,1,0)+IF(B183>D183,1,0)+IF(B185>D185,1,0)","v":0},{"$f":"IF(D180<B180,1,0)+IF(B183<D183,1,0)+IF(B185<D185,1,0)","v":3},{"$f":"IF(B180=\"\",0,IF(B180=D180,1,0))+IF(B183=\"\",0,IF(B183=D183,1,0))+IF(B185=\"\",0,IF(B185=D185,1,0))","v":0},{"$f":"IF(D180=\"\",0,+D180)+IF(B183=\"\",0,+B183)+IF(B185=\"\",0,+B185)","v":0},{"$f":"IF(B180=\"\",0,+B180)+IF(D183=\"\",0,+D183)+IF(D185=\"\",0,+D185)","v":13},{"$f":"L182-M182","v":-13},{"$f":"I182*3+K182","v":0},null,"Kostas Stamokostas (GRE)",3,2,1,0,8,5,3,6]
[{"$f":"$C13","v":"Jonathan Dotto (GIB)"},{"$f":"IF('Séries individuels'!D212=\"\",\"\",'Séries individuels'!D212)","v":0},"-",{"$f":"IF('Séries individuels'!F212=\"\",\"\",'Séries individuels'!F212)","v":2},{"$f":"$E13","v":"Raffaele Lombardi (AUS)"},null,{"$f":"A181","v":"Kostas Stamokostas (GRE)"},{"$f":"IF(B181=\"\",0,1)+IF(D182=\"\",0,1)+IF(D185=\"\",0,1)","v":3},{"$f":"IF(B181>D181,1,0)+IF(D182>B182,1,0)+IF(D185>B185,1,0)","v":2},{"$f":"IF(B181<D181,1,0)+IF(D182<B182,1,0)+IF(D185<B185,1,0)","v":1},{"$f":"IF(B181=\"\",0,IF(B181=D181,1,0))+IF(B182=\"\",0,IF(B182=D182,1,0))+IF(B185=\"\",0,IF(B185=D185,1,0))","v":0},{"$f":"IF(B181=\"\",0,+B181)+IF(D182=\"\",0,+D182)+IF(D185=\"\",0,+D185)","v":8},{"$f":"IF(D181=\"\",0,+D181)+IF(B182=\"\",0,+B182)+IF(B185=\"\",0,+B185)","v":5},{"$f":"L183-M183","v":3},{"$f":"I183*3+K183","v":6},null,"Raffaele Lombardi (AUS)",3,1,2,0,3,10,-7,3]
[{"$f":"$E13","v":"Raffaele Lombardi (AUS)"},{"$f":"IF('Séries individuels'!D345=\"\",\"\",'Séries individuels'!D345)","v":1},"-",{"$f":"IF('Séries individuels'!F345=\"\",\"\",'Séries individuels'!F345)","v":6},{"$f":"$B13","v":"Christophe Dheur (BEL)"},null,{"$f":"E181","v":"Raffaele Lombardi (AUS)"},{"$f":"IF(D181=\"\",0,1)+IF(D183=\"\",0,1)+IF(B184=\"\",0,1)","v":3},{"$f":"IF(D181>B181,1,0)+IF(D183>B183,1,0)+IF(B184>D184,1,0)","v":1},{"$f":"IF(D181<B181,1,0)+IF(D183<B183,1,0)+IF(B184<D184,1,0)","v":2},{"$f":"IF(B181=\"\",0,IF(B181=D181,1,0))+IF(B183=\"\",0,IF(B183=D183,1,0))+IF(B184=\"\",0,IF(B184=D184,1,0))","v":0},{"$f":"IF(D181=\"\",0,+D181)+IF(D183=\"\",0,+D183)+IF(B184=\"\",0,+B184)","v":3},{"$f":"IF(B181=\"\",0,+B181)+IF(B183=\"\",0,+B183)+IF(D184=\"\",0,+D184)","v":10},{"$f":"L184-M184","v":-7},{"$f":"I184*3+K184","v":3},null,"Jonathan Dotto (GIB)",3,0,3,0,0,13,-13,0]
[{"$f":"$C13","v":"Jonathan Dotto (GIB)"},{"$f":"IF('Séries individuels'!D346=\"\",\"\",'Séries individuels'!D346)","v":0},"-",{"$f":"IF('Séries individuels'!F346=\"\",\"\",'Séries individuels'!F346)","v":3},{"$f":"$D13","v":"Kostas Stamokostas (GRE)"},null,null,null,{"$f":"SUM(I181:I184)","v":6},{"$f":"SUM(J181:J184)","v":6},{"$f":"SUM(K181:K184)","v":0},{"$f":"SUM(L181:L184)","v":30},{"$f":"SUM(M181:M184)","v":30},{"$f":"SUM(N181:N184)","v":0}]
[]
["Group 12"]
[]
[{"$f":"$B14","v":"Angelo Borg (MLT)"},{"$f":"IF('Séries individuels'!D79=\"\",\"\",'Séries individuels'!D79)","v":9},"-",{"$f":"IF('Séries individuels'!F79=\"\",\"\",'Séries individuels'!F79)","v":0},{"$f":"$C14","v":"Suguru Fujino (JPN)"},null,null,"P","W","L","N","+","-","d","PTS",null,null,"P","W","L","N","+","-","d","PTS"]
[{"$f":"$D14","v":"Bessim Golger (BEL)"},{"$f":"IF('Séries individuels'!D80=\"\",\"\",'Séries individuels'!D80)","v":5},"-",{"$f":"IF('Séries individuels'!F80=\"\",\"\",'Séries individuels'!F80)","v":0},{"$f":"$E14","v":"Mike Tillman (USA)"},null,{"$f":"A189","v":"Angelo Borg (MLT)"},{"$f":"IF(B189=\"\",0,1)+IF(B191=\"\",0,1)+IF(D193=\"\",0,1)","v":3},{"$f":"IF(B189>D189,1,0)+IF(B191>D191,1,0)+IF(D193>B193,1,0)","v":2},{"$f":"IF(B189<D189,1,0)+IF(B191<D191,1,0)+IF(D193<B193,1,0)","v":1},{"$f":"IF(B189=\"\",0,IF(B189=D189,1,0))+IF(B191=\"\",0,IF(B191=D191,1,0))+IF(B193=\"\",0,IF(B193=D193,1,0))","v":0},{"$f":"IF(B189=\"\",0,+B189)+IF(B191=\"\",0,+B191)+IF(D193=\"\",0,+D193)","v":13},{"$f":"IF(D189=\"\",0,+D189)+IF(D191=\"\",0,+D191)+IF(B193=\"\",0,+B193)","v":1},{"$f":"L190-M190","v":12},{"$f":"I190*3+K190","v":6},null,"Bessim Golger (BEL)",3,3,0,0,10,1,9,9]
[{"$f":"$B14","v":"Angelo Borg (MLT)"},{"$f":"IF('Séries individuels'!D213=\"\",\"\",'Séries individuels'!D213)","v":0},"-",{"$f":"IF('Séries individuels'!F213=\"\",\"\",'Séries individuels'!F213)","v":1},{"$f":"$D14","v":"Bessim Golger (BEL)"},null,{"$f":"E189","v":"Suguru Fujino (JPN)"},{"$f":"IF(D189=\"\",0,1)+IF(B192=\"\",0,1)+IF(B194=\"\",0,1)","v":3},{"$f":"IF(D189>B189,1,0)+IF(B192>D192,1,0)+IF(B194>D194,1,0)","v":0},{"$f":"IF(D189<B189,1,0)+IF(B192<D192,1,0)+IF(B194<D194,1,0)","v":3},{"$f":"IF(B189=\"\",0,IF(B189=D189,1,0))+IF(B192=\"\",0,IF(B192=D192,1,0))+IF(B194=\"\",0,IF(B194=D194,1,0))","v":0},{"$f":"IF(D189=\"\",0,+D189)+IF(B192=\"\",0,+B192)+IF(B194=\"\",0,+B194)","v":1},{"$f":"IF(B189=\"\",0,+B189)+IF(D192=\"\",0,+D192)+IF(D194=\"\",0,+D194)","v":18},{"$f":"L191-M191","v":-17},{"$f":"I191*3+K191","v":0},null,"Angelo Borg (MLT)",3,2,1,0,13,1,12,6]
[{"$f":"$C14","v":"Suguru Fujino (JPN)"},{"$f":"IF('Séries individuels'!D214=\"\",\"\",'Séries individuels'!D214)","v":0},"-",{"$f":"IF('Séries individuels'!F214=\"\",\"\",'Séries individuels'!F214)","v":5},{"$f":"$E14","v":"Mike Tillman (USA)"},null,{"$f":"A190","v":"Bessim Golger (BEL)"},{"$f":"IF(B190=\"\",0,1)+IF(D191=\"\",0,1)+IF(D194=\"\",0,1)","v":3},{"$f":"IF(B190>D190,1,0)+IF(D191>B191,1,0)+IF(D194>B194,1,0)","v":3},{"$f":"IF(B190<D190,1,0)+IF(D191<B191,1,0)+IF(D194<B194,1,0)","v":0},{"$f":"IF(B190=\"\",0,IF(B190=D190,1,0))+IF(B191=\"\",0,IF(B191=D191,1,0))+IF(B194=\"\",0,IF(B194=D194,1,0))","v":0},{"$f":"IF(B190=\"\",0,+B190)+IF(D191=\"\",0,+D191)+IF(D194=\"\",0,+D194)","v":10},{"$f":"IF(D190=\"\",0,+D190)+IF(B191=\"\",0,+B191)+IF(B194=\"\",0,+B194)","v":1},{"$f":"L192-M192","v":9},{"$f":"I192*3+K192","v":9},null,"Mike Tillman (USA)",3,1,2,0,5,9,-4,3]
[{"$f":"$E14","v":"Mike Tillman (USA)"},{"$f":"IF('Séries individuels'!D347=\"\",\"\",'Séries individuels'!D347)","v":0},"-",{"$f":"IF('Séries individuels'!F347=\"\",\"\",'Séries individuels'!F347)","v":4},{"$f":"$B14","v":"Angelo Borg (MLT)"},null,{"$f":"E190","v":"Mike Tillman (USA)"},{"$f":"IF(D190=\"\",0,1)+IF(D192=\"\",0,1)+IF(B193=\"\",0,1)","v":3},{"$f":"IF(D190>B190,1,0)+IF(D192>B192,1,0)+IF(B193>D193,1,0)","v":1},{"$f":"IF(D190<B190,1,0)+IF(D192<B192,1,0)+IF(B193<D193,1,0)","v":2},{"$f":"IF(B190=\"\",0,IF(B190=D190,1,0))+IF(B192=\"\",0,IF(B192=D192,1,0))+IF(B193=\"\",0,IF(B193=D193,1,0))","v":0},{"$f":"IF(D190=\"\",0,+D190)+IF(D192=\"\",0,+D192)+IF(B193=\"\",0,+B193)","v":5},{"$f":"IF(B190=\"\",0,+B190)+IF(B192=\"\",0,+B192)+IF(D193=\"\",0,+D193)","v":9},{"$f":"L193-M193","v":-4},{"$f":"I193*3+K193","v":3},null,"Suguru Fujino (JPN)",3,0,3,0,1,18,-17,0]
[{"$f":"$C14","v":"Suguru Fujino (JPN)"},{"$f":"IF('Séries individuels'!D348=\"\",\"\",'Séries individuels'!D348)","v":1},"-",{"$f":"IF('Séries individuels'!F348=\"\",\"\",'Séries individuels'!F348)","v":4},{"$f":"$D14","v":"Bessim Golger (BEL)"},null,null,null,{"$f":"SUM(I190:I193)","v":6},{"$f":"SUM(J190:J193)","v":6},{"$f":"SUM(K190:K193)","v":0},{"$f":"SUM(L190:L193)","v":29},{"$f":"SUM(M190:M193)","v":29},{"$f":"SUM(N190:N193)","v":0}]
[]
["Group 13"]
[]
[{"$f":"$B15","v":"Sérgio Ramos (POR)"},{"$f":"IF('Séries individuels'!D81=\"\",\"\",'Séries individuels'!D81)","v":7},"-",{"$f":"IF('Séries individuels'!F81=\"\",\"\",'Séries individuels'!F81)","v":0},{"$f":"$C15","v":"Lawrence Alvarez (GIB)"},null,null,"P","W","L","N","+","-","d","PTS",null,null,"P","W","L","N","+","-","d","PTS"]
[{"$f":"$D15","v":"Rémy Huynh (BEL)"},{"$f":"IF('Séries individuels'!D82=\"\",\"\",'Séries individuels'!D82)","v":2},"-",{"$f":"IF('Séries individuels'!F82=\"\",\"\",'Séries individuels'!F82)","v":1},{"$f":"$E15","v":"Christian Filippella (USA)"},null,{"$f":"A198","v":"Sérgio Ramos (POR)"},{"$f":"IF(B198=\"\",0,1)+IF(B200=\"\",0,1)+IF(D202=\"\",0,1)","v":3},{"$f":"IF(B198>D198,1,0)+IF(B200>D200,1,0)+IF(D202>B202,1,0)","v":2},{"$f":"IF(B198<D198,1,0)+IF(B200<D200,1,0)+IF(D202<B202,1,0)","v":0},{"$f":"IF(B198=\"\",0,IF(B198=D198,1,0))+IF(B200=\"\",0,IF(B200=D200,1,0))+IF(B202=\"\",0,IF(B202=D202,1,0))","v":1},{"$f":"IF(B198=\"\",0,+B198)+IF(B200=\"\",0,+B200)+IF(D202=\"\",0,+D202)","v":11},{"$f":"IF(D198=\"\",0,+D198)+IF(D200=\"\",0,+D200)+IF(B202=\"\",0,+B202)","v":2},{"$f":"L199-M199","v":9},{"$f":"I199*3+K199","v":7},null,"Rémy Huynh (BEL)",3,2,0,1,13,2,11,7]
[{"$f":"$B15","v":"Sérgio Ramos (POR)"},{"$f":"IF('Séries individuels'!D215=\"\",\"\",'Séries individuels'!D215)","v":1},"-",{"$f":"IF('Séries individuels'!F215=\"\",\"\",'Séries individuels'!F215)","v":1},{"$f":"$D15","v":"Rémy Huynh (BEL)"},null,{"$f":"E198","v":"Lawrence Alvarez (GIB)"},{"$f":"IF(D198=\"\",0,1)+IF(B201=\"\",0,1)+IF(B203=\"\",0,1)","v":3},{"$f":"IF(D198>B198,1,0)+IF(B201>D201,1,0)+IF(B203>D203,1,0)","v":0},{"$f":"IF(D198<B198,1,0)+IF(B201<D201,1,0)+IF(B203<D203,1,0)","v":3},{"$f":"IF(B198=\"\",0,IF(B198=D198,1,0))+IF(B201=\"\",0,IF(B201=D201,1,0))+IF(B203=\"\",0,IF(B203=D203,1,0))","v":0},{"$f":"IF(D198=\"\",0,+D198)+IF(B201=\"\",0,+B201)+IF(B203=\"\",0,+B203)","v":1},{"$f":"IF(B198=\"\",0,+B198)+IF(D201=\"\",0,+D201)+IF(D203=\"\",0,+D203)","v":27},{"$f":"L200-M200","v":-26},{"$f":"I200*3+K200","v":0},null,"Sérgio Ramos (POR)",3,2,0,1,11,2,9,7]
[{"$f":"$C15","v":"Lawrence Alvarez (GIB)"},{"$f":"IF('Séries individuels'!D216=\"\",\"\",'Séries individuels'!D216)","v":1},"-",{"$f":"IF('Séries individuels'!F216=\"\",\"\",'Séries individuels'!F216)","v":10},{"$f":"$E15","v":"Christian Filippella (USA)"},null,{"$f":"A199","v":"Rémy Huynh (BEL)"},{"$f":"IF(B199=\"\",0,1)+IF(D200=\"\",0,1)+IF(D203=\"\",0,1)","v":3},{"$f":"IF(B199>D199,1,0)+IF(D200>B200,1,0)+IF(D203>B203,1,0)","v":2},{"$f":"IF(B199<D199,1,0)+IF(D200<B200,1,0)+IF(D203<B203,1,0)","v":0},{"$f":"IF(B199=\"\",0,IF(B199=D199,1,0))+IF(B200=\"\",0,IF(B200=D200,1,0))+IF(B203=\"\",0,IF(B203=D203,1,0))","v":1},{"$f":"IF(B199=\"\",0,+B199)+IF(D200=\"\",0,+D200)+IF(D203=\"\",0,+D203)","v":13},{"$f":"IF(D199=\"\",0,+D199)+IF(B200=\"\",0,+B200)+IF(B203=\"\",0,+B203)","v":2},{"$f":"L201-M201","v":11},{"$f":"I201*3+K201","v":7},null,"Christian Filippella (USA)",3,1,2,0,12,6,6,3]
[{"$f":"$E15","v":"Christian Filippella (USA)"},{"$f":"IF('Séries individuels'!D349=\"\",\"\",'Séries individuels'!D349)","v":1},"-",{"$f":"IF('Séries individuels'!F349=\"\",\"\",'Séries individuels'!F349)","v":3},{"$f":"$B15","v":"Sérgio Ramos (POR)"},null,{"$f":"E199","v":"Christian Filippella (USA)"},{"$f":"IF(D199=\"\",0,1)+IF(D201=\"\",0,1)+IF(B202=\"\",0,1)","v":3},{"$f":"IF(D199>B199,1,0)+IF(D201>B201,1,0)+IF(B202>D202,1,0)","v":1},{"$f":"IF(D199<B199,1,0)+IF(D201<B201,1,0)+IF(B202<D202,1,0)","v":2},{"$f":"IF(B199=\"\",0,IF(B199=D199,1,0))+IF(B201=\"\",0,IF(B201=D201,1,0))+IF(B202=\"\",0,IF(B202=D202,1,0))","v":0},{"$f":"IF(D199=\"\",0,+D199)+IF(D201=\"\",0,+D201)+IF(B202=\"\",0,+B202)","v":12},{"$f":"IF(B199=\"\",0,+B199)+IF(B201=\"\",0,+B201)+IF(D202=\"\",0,+D202)","v":6},{"$f":"L202-M202","v":6},{"$f":"I202*3+K202","v":3},null,"Lawrence Alvarez (GIB)",3,0,3,0,1,27,-26,0]
[{"$f":"$C15","v":"Lawrence Alvarez (GIB)"},{"$f":"IF('Séries individuels'!D350=\"\",\"\",'Séries individuels'!D350)","v":0},"-",{"$f":"IF('Séries individuels'!F350=\"\",\"\",'Séries individuels'!F350)","v":10},{"$f":"$D15","v":"Rémy Huynh (BEL)"},null,null,null,{"$f":"SUM(I199:I202)","v":5},{"$f":"SUM(J199:J202)","v":5},{"$f":"SUM(K199:K202)","v":2},{"$f":"SUM(L199:L202)","v":37},{"$f":"SUM(M199:M202)","v":37},{"$f":"SUM(N199:N202)","v":0}]
[]
["Group 14"]
[]
[{"$f":"$B16","v":"Kostas Seses (GRE)"},{"$f":"IF('Séries individuels'!D83=\"\",\"\",'Séries individuels'!D83)","v":2},"-",{"$f":"IF('Séries individuels'!F83=\"\",\"\",'Séries individuels'!F83)","v":3},{"$f":"$C16","v":"Axel Donval (FRA)"},null,null,"P","W","L","N","+","-","d","PTS",null,null,"P","W","L","N","+","-","d","PTS"]
[{"$f":"$D16","v":"Nuno Henriques (POR)"},{"$f":"IF('Séries individuels'!D84=\"\",\"\",'Séries individuels'!D84)","v":0},"-",{"$f":"IF('Séries individuels'!F84=\"\",\"\",'Séries individuels'!F84)","v":0},{"$f":"$E16","v":"Luca Martinelli (ENG)"},null,{"$f":"A207","v":"Kostas Seses (GRE)"},{"$f":"IF(B207=\"\",0,1)+IF(B209=\"\",0,1)+IF(D211=\"\",0,1)","v":3},{"$f":"IF(B207>D207,1,0)+IF(B209>D209,1,0)+IF(D211>B211,1,0)","v":2},{"$f":"IF(B207<D207,1,0)+IF(B209<D209,1,0)+IF(D211<B211,1,0)","v":1},{"$f":"IF(B207=\"\",0,IF(B207=D207,1,0))+IF(B209=\"\",0,IF(B209=D209,1,0))+IF(B211=\"\",0,IF(B211=D211,1,0))","v":0},{"$f":"IF(B207=\"\",0,+B207)+IF(B209=\"\",0,+B209)+IF(D211=\"\",0,+D211)","v":7},{"$f":"IF(D207=\"\",0,+D207)+IF(D209=\"\",0,+D209)+IF(B211=\"\",0,+B211)","v":3},{"$f":"L208-M208","v":4},{"$f":"I208*3+K208","v":6},null,"Axel Donval (FRA)",3,2,1,0,9,3,6,6]
[{"$f":"$B16","v":"Kostas Seses (GRE)"},{"$f":"IF('Séries individuels'!D217=\"\",\"\",'Séries individuels'!D217)","v":3},"-",{"$f":"IF('Séries individuels'!F217=\"\",\"\",'Séries individuels'!F217)","v":0},{"$f":"$D16","v":"Nuno Henriques (POR)"},null,{"$f":"E207","v":"Axel Donval (FRA)"},{"$f":"IF(D207=\"\",0,1)+IF(B210=\"\",0,1)+IF(B212=\"\",0,1)","v":3},{"$f":"IF(D207>B207,1,0)+IF(B210>D210,1,0)+IF(B212>D212,1,0)","v":2},{"$f":"IF(D207<B207,1,0)+IF(B210<D210,1,0)+IF(B212<D212,1,0)","v":1},{"$f":"IF(B207=\"\",0,IF(B207=D207,1,0))+IF(B210=\"\",0,IF(B210=D210,1,0))+IF(B212=\"\",0,IF(B212=D212,1,0))","v":0},{"$f":"IF(D207=\"\",0,+D207)+IF(B210=\"\",0,+B210)+IF(B212=\"\",0,+B212)","v":9},{"$f":"IF(B207=\"\",0,+B207)+IF(D210=\"\",0,+D210)+IF(D212=\"\",0,+D212)","v":3},{"$f":"L209-M209","v":6},{"$f":"I209*3+K209","v":6},null,"Kostas Seses (GRE)",3,2,1,0,7,3,4,6]
[{"$f":"$C16","v":"Axel Donval (FRA)"},{"$f":"IF('Séries individuels'!D218=\"\",\"\",'Séries individuels'!D218)","v":0},"-",{"$f":"IF('Séries individuels'!F218=\"\",\"\",'Séries individuels'!F218)","v":1},{"$f":"$E16","v":"Luca Martinelli (ENG)"},null,{"$f":"A208","v":"Nuno Henriques (POR)"},{"$f":"IF(B208=\"\",0,1)+IF(D209=\"\",0,1)+IF(D212=\"\",0,1)","v":3},{"$f":"IF(B208>D208,1,0)+IF(D209>B209,1,0)+IF(D212>B212,1,0)","v":0},{"$f":"IF(B208<D208,1,0)+IF(D209<B209,1,0)+IF(D212<B212,1,0)","v":2},{"$f":"IF(B208=\"\",0,IF(B208=D208,1,0))+IF(B209=\"\",0,IF(B209=D209,1,0))+IF(B212=\"\",0,IF(B212=D212,1,0))","v":1},{"$f":"IF(B208=\"\",0,+B208)+IF(D209=\"\",0,+D209)+IF(D212=\"\",0,+D212)","v":0},{"$f":"IF(D208=\"\",0,+D208)+IF(B209=\"\",0,+B209)+IF(B212=\"\",0,+B212)","v":9},{"$f":"L210-M210","v":-9},{"$f":"I210*3+K210","v":1},null,"Luca Martinelli (ENG)",3,1,1,1,1,2,-1,4]
[{"$f":"$E16","v":"Luca Martinelli (ENG)"},{"$f":"IF('Séries individuels'!D351=\"\",\"\",'Séries individuels'!D351)","v":0},"-",{"$f":"IF('Séries individuels'!F351=\"\",\"\",'Séries individuels'!F351)","v":2},{"$f":"$B16","v":"Kostas Seses (GRE)"},null,{"$f":"E208","v":"Luca Martinelli (ENG)"},{"$f":"IF(D208=\"\",0,1)+IF(D210=\"\",0,1)+IF(B211=\"\",0,1)","v":3},{"$f":"IF(D208>B208,1,0)+IF(D210>B210,1,0)+IF(B211>D211,1,0)","v":1},{"$f":"IF(D208<B208,1,0)+IF(D210<B210,1,0)+IF(B211<D211,1,0)","v":1},{"$f":"IF(B208=\"\",0,IF(B208=D208,1,0))+IF(B210=\"\",0,IF(B210=D210,1,0))+IF(B211=\"\",0,IF(B211=D211,1,0))","v":1},{"$f":"IF(D208=\"\",0,+D208)+IF(D210=\"\",0,+D210)+IF(B211=\"\",0,+B211)","v":1},{"$f":"IF(B208=\"\",0,+B208)+IF(B210=\"\",0,+B210)+IF(D211=\"\",0,+D211)","v":2},{"$f":"L211-M211","v":-1},{"$f":"I211*3+K211","v":4},null,"Nuno Henriques (POR)",3,0,2,1,0,9,-9,1]
[{"$f":"$C16","v":"Axel Donval (FRA)"},{"$f":"IF('Séries individuels'!D352=\"\",\"\",'Séries individuels'!D352)","v":6},"-",{"$f":"IF('Séries individuels'!F352=\"\",\"\",'Séries individuels'!F352)","v":0},{"$f":"$D16","v":"Nuno Henriques (POR)"},null,null,null,{"$f":"SUM(I208:I211)","v":5},{"$f":"SUM(J208:J211)","v":5},{"$f":"SUM(K208:K211)","v":2},{"$f":"SUM(L208:L211)","v":17},{"$f":"SUM(M208:M211)","v":17},{"$f":"SUM(N208:N211)","v":0}]
[]
["Group 15"]
[]
[{"$f":"$B17","v":"Derek Conti (MLT)"},{"$f":"IF('Séries individuels'!D85=\"\",\"\",'Séries individuels'!D85)","v":3},"-",{"$f":"IF('Séries individuels'!F85=\"\",\"\",'Séries individuels'!F85)","v":0},{"$f":"$C17","v":"Anton V. Aleksadrovich (RUS)"},null,null,"P","W","L","N","+","-","d","PTS",null,null,"P","W","L","N","+","-","d","PTS"]
[{"$f":"$D17","v":"Gareth Christie (SCO)"},{"$f":"IF('Séries individuels'!D86=\"\",\"\",'Séries individuels'!D86)","v":0},"-",{"$f":"IF('Séries individuels'!F86=\"\",\"\",'Séries individuels'!F86)","v":0},{"$f":"$E17","v":"Spyros Patrinos (GRE)"},null,{"$f":"A216","v":"Derek Conti (MLT)"},{"$f":"IF(B216=\"\",0,1)+IF(B218=\"\",0,1)+IF(D220=\"\",0,1)","v":3},{"$f":"IF(B216>D216,1,0)+IF(B218>D218,1,0)+IF(D220>B220,1,0)","v":2},{"$f":"IF(B216<D216,1,0)+IF(B218<D218,1,0)+IF(D220<B220,1,0)","v":0},{"$f":"IF(B216=\"\",0,IF(B216=D216,1,0))+IF(B218=\"\",0,IF(B218=D218,1,0))+IF(B220=\"\",0,IF(B220=D220,1,0))","v":1},{"$f":"IF(B216=\"\",0,+B216)+IF(B218=\"\",0,+B218)+IF(D220=\"\",0,+D220)","v":8},{"$f":"IF(D216=\"\",0,+D216)+IF(D218=\"\",0,+D218)+IF(B220=\"\",0,+B220)","v":3},{"$f":"L217-M217","v":5},{"$f":"I217*3+K217","v":7},null,"Derek Conti (MLT)",3,2,0,1,8,3,5,7]
[{"$f":"$B17","v":"Derek Conti (MLT)"},{"$f":"IF('Séries individuels'!D219=\"\",\"\",'Séries individuels'!D219)","v":2},"-",{"$f":"IF('Séries individuels'!F219=\"\",\"\",'Séries individuels'!F219)","v":0},{"$f":"$D17","v":"Gareth Christie (SCO)"},null,{"$f":"E216","v":"Anton V. Aleksadrovich (RUS)"},{"$f":"IF(D216=\"\",0,1)+IF(B219=\"\",0,1)+IF(B221=\"\",0,1)","v":3},{"$f":"IF(D216>B216,1,0)+IF(B219>D219,1,0)+IF(B221>D221,1,0)","v":0},{"$f":"IF(D216<B216,1,0)+IF(B219<D219,1,0)+IF(B221<D221,1,0)","v":3},{"$f":"IF(B216=\"\",0,IF(B216=D216,1,0))+IF(B219=\"\",0,IF(B219=D219,1,0))+IF(B221=\"\",0,IF(B221=D221,1,0))","v":0},{"$f":"IF(D216=\"\",0,+D216)+IF(B219=\"\",0,+B219)+IF(B221=\"\",0,+B221)","v":0},{"$f":"IF(B216=\"\",0,+B216)+IF(D219=\"\",0,+D219)+IF(D221=\"\",0,+D221)","v":34},{"$f":"L218-M218","v":-34},{"$f":"I218*3+K218","v":0},null,"Spyros Patrinos (GRE)",3,1,0,2,20,3,17,5]
[{"$f":"$C17","v":"Anton V. Aleksadrovich (RUS)"},{"$f":"IF('Séries individuels'!D220=\"\",\"\",'Séries individuels'!D220)","v":0},"-",{"$f":"IF('Séries individuels'!F220=\"\",\"\",'Séries individuels'!F220)","v":17},{"$f":"$E17","v":"Spyros Patrinos (GRE)"},null,{"$f":"A217","v":"Gareth Christie (SCO)"},{"$f":"IF(B217=\"\",0,1)+IF(D218=\"\",0,1)+IF(D221=\"\",0,1)","v":3},{"$f":"IF(B217>D217,1,0)+IF(D218>B218,1,0)+IF(D221>B221,1,0)","v":1},{"$f":"IF(B217<D217,1,0)+IF(D218<B218,1,0)+IF(D221<B221,1,0)","v":1},{"$f":"IF(B217=\"\",0,IF(B217=D217,1,0))+IF(B218=\"\",0,IF(B218=D218,1,0))+IF(B221=\"\",0,IF(B221=D221,1,0))","v":1},{"$f":"IF(B217=\"\",0,+B217)+IF(D218=\"\",0,+D218)+IF(D221=\"\",0,+D221)","v":14},{"$f":"IF(D217=\"\",0,+D217)+IF(B218=\"\",0,+B218)+IF(B221=\"\",0,+B221)","v":2},{"$f":"L219-M219","v":12},{"$f":"I219*3+K219","v":4},null,"Gareth Christie (SCO)",3,1,1,1,14,2,12,4]
[{"$f":"$E17","v":"Spyros Patrinos (GRE)"},{"$f":"IF('Séries individuels'!D353=\"\",\"\",'Séries individuels'!D353)","v":3},"-",{"$f":"IF('Séries individuels'!F353=\"\",\"\",'Séries individuels'!F353)","v":3},{"$f":"$B17","v":"Derek Conti (MLT)"},null,{"$f":"E217","v":"Spyros Patrinos (GRE)"},{"$f":"IF(D217=\"\",0,1)+IF(D219=\"\",0,1)+IF(B220=\"\",0,1)","v":3},{"$f":"IF(D217>B217,1,0)+IF(D219>B219,1,0)+IF(B220>D220,1,0)","v":1},{"$f":"IF(D217<B217,1,0)+IF(D219<B219,1,0)+IF(B220<D220,1,0)","v":0},{"$f":"IF(B217=\"\",0,IF(B217=D217,1,0))+IF(B219=\"\",0,IF(B219=D219,1,0))+IF(B220=\"\",0,IF(B220=D220,1,0))","v":2},{"$f":"IF(D217=\"\",0,+D217)+IF(D219=\"\",0,+D219)+IF(B220=\"\",0,+B220)","v":20},{"$f":"IF(B217=\"\",0,+B217)+IF(B219=\"\",0,+B219)+IF(D220=\"\",0,+D220)","v":3},{"$f":"L220-M220","v":17},{"$f":"I220*3+K220","v":5},null,"Anton V. Aleksadrovich (RUS)",3,0,3,0,0,34,-34,0]
[{"$f":"$C17","v":"Anton V. Aleksadrovich (RUS)"},{"$f":"IF('Séries individuels'!D354=\"\",\"\",'Séries individuels'!D354)","v":0},"-",{"$f":"IF('Séries individuels'!F354=\"\",\"\",'Séries individuels'!F354)","v":14},{"$f":"$D17","v":"Gareth Christie (SCO)"},null,null,null,{"$f":"SUM(I217:I220)","v":4},{"$f":"SUM(J217:J220)","v":4},{"$f":"SUM(K217:K220)","v":4},{"$f":"SUM(L217:L220)","v":42},{"$f":"SUM(M217:M220)","v":42},{"$f":"SUM(N217:N220)","v":0}]
[]
["Group 16"]
[]
[{"$f":"$B18","v":"Wolfgang Haas (AUT)"},{"$f":"IF('Séries individuels'!D87=\"\",\"\",'Séries individuels'!D87)","v":8},"-",{"$f":"IF('Séries individuels'!F87=\"\",\"\",'Séries individuels'!F87)","v":0},{"$f":"$C18","v":"Dmitry L. Valeriavitch (RUS)"},null,null,"P","W","L","N","+","-","d","PTS",null,null,"P","W","L","N","+","-","d","PTS"]
[{"$f":"$D18","v":"Luis Abreu (POR)"},{"$f":"IF('Séries individuels'!D88=\"\",\"\",'Séries individuels'!D88)","v":2},"-",{"$f":"IF('Séries individuels'!F88=\"\",\"\",'Séries individuels'!F88)","v":5},{"$f":"$E18","v":"Maikel de Haas (NED)"},null,{"$f":"A225","v":"Wolfgang Haas (AUT)"},{"$f":"IF(B225=\"\",0,1)+IF(B227=\"\",0,1)+IF(D229=\"\",0,1)","v":3},{"$f":"IF(B225>D225,1,0)+IF(B227>D227,1,0)+IF(D229>B229,1,0)","v":2},{"$f":"IF(B225<D225,1,0)+IF(B227<D227,1,0)+IF(D229<B229,1,0)","v":0},{"$f":"IF(B225=\"\",0,IF(B225=D225,1,0))+IF(B227=\"\",0,IF(B227=D227,1,0))+IF(B229=\"\",0,IF(B229=D229,1,0))","v":1},{"$f":"IF(B225=\"\",0,+B225)+IF(B227=\"\",0,+B227)+IF(D229=\"\",0,+D229)","v":16},{"$f":"IF(D225=\"\",0,+D225)+IF(D227=\"\",0,+D227)+IF(B229=\"\",0,+B229)","v":6},{"$f":"L226-M226","v":10},{"$f":"I226*3+K226","v":7},null,"Maikel de Haas (NED)",3,2,0,1,19,7,12,7]
[{"$f":"$B18","v":"Wolfgang Haas (AUT)"},{"$f":"IF('Séries individuels'!D221=\"\",\"\",'Séries individuels'!D221)","v":4},"-",{"$f":"IF('Séries individuels'!F221=\"\",\"\",'Séries individuels'!F221)","v":2},{"$f":"$D18","v":"Luis Abreu (POR)"},null,{"$f":"E225","v":"Dmitry L. Valeriavitch (RUS)"},{"$f":"IF(D225=\"\",0,1)+IF(B228=\"\",0,1)+IF(B230=\"\",0,1)","v":3},{"$f":"IF(D225>B225,1,0)+IF(B228>D228,1,0)+IF(B230>D230,1,0)","v":0},{"$f":"IF(D225<B225,1,0)+IF(B228<D228,1,0)+IF(B230<D230,1,0)","v":3},{"$f":"IF(B225=\"\",0,IF(B225=D225,1,0))+IF(B228=\"\",0,IF(B228=D228,1,0))+IF(B230=\"\",0,IF(B230=D230,1,0))","v":0},{"$f":"IF(D225=\"\",0,+D225)+IF(B228=\"\",0,+B228)+IF(B230=\"\",0,+B230)","v":1},{"$f":"IF(B225=\"\",0,+B225)+IF(D228=\"\",0,+D228)+IF(D230=\"\",0,+D230)","v":27},{"$f":"L227-M227","v":-26},{"$f":"I227*3+K227","v":0},null,"Wolfgang Haas (AUT)",3,2,0,1,16,6,10,7]
[{"$f":"$C18","v":"Dmitry L. Valeriavitch (RUS)"},{"$f":"IF('Séries individuels'!D222=\"\",\"\",'Séries individuels'!D222)","v":1},"-",{"$f":"IF('Séries individuels'!F222=\"\",\"\",'Séries individuels'!F222)","v":10},{"$f":"$E18","v":"Maikel de Haas (NED)"},null,{"$f":"A226","v":"Luis Abreu (POR)"},{"$f":"IF(B226=\"\",0,1)+IF(D227=\"\",0,1)+IF(D230=\"\",0,1)","v":3},{"$f":"IF(B226>D226,1,0)+IF(D227>B227,1,0)+IF(D230>B230,1,0)","v":1},{"$f":"IF(B226<D226,1,0)+IF(D227<B227,1,0)+IF(D230<B230,1,0)","v":2},{"$f":"IF(B226=\"\",0,IF(B226=D226,1,0))+IF(B227=\"\",0,IF(B227=D227,1,0))+IF(B230=\"\",0,IF(B230=D230,1,0))","v":0},{"$f":"IF(B226=\"\",0,+B226)+IF(D227=\"\",0,+D227)+IF(D230=\"\",0,+D230)","v":13},{"$f":"IF(D226=\"\",0,+D226)+IF(B227=\"\",0,+B227)+IF(B230=\"\",0,+B230)","v":9},{"$f":"L228-M228","v":4},{"$f":"I228*3+K228","v":3},null,"Luis Abreu (POR)",3,1,2,0,13,9,4,3]
[{"$f":"$E18","v":"Maikel de Haas (NED)"},{"$f":"IF('Séries individuels'!D355=\"\",\"\",'Séries individuels'!D355)","v":4},"-",{"$f":"IF('Séries individuels'!F355=\"\",\"\",'Séries individuels'!F355)","v":4},{"$f":"$B18","v":"Wolfgang Haas (AUT)"},null,{"$f":"E226","v":"Maikel de Haas (NED)"},{"$f":"IF(D226=\"\",0,1)+IF(D228=\"\",0,1)+IF(B229=\"\",0,1)","v":3},{"$f":"IF(D226>B226,1,0)+IF(D228>B228,1,0)+IF(B229>D229,1,0)","v":2},{"$f":"IF(D226<B226,1,0)+IF(D228<B228,1,0)+IF(B229<D229,1,0)","v":0},{"$f":"IF(B226=\"\",0,IF(B226=D226,1,0))+IF(B228=\"\",0,IF(B228=D228,1,0))+IF(B229=\"\",0,IF(B229=D229,1,0))","v":1},{"$f":"IF(D226=\"\",0,+D226)+IF(D228=\"\",0,+D228)+IF(B229=\"\",0,+B229)","v":19},{"$f":"IF(B226=\"\",0,+B226)+IF(B228=\"\",0,+B228)+IF(D229=\"\",0,+D229)","v":7},{"$f":"L229-M229","v":12},{"$f":"I229*3+K229","v":7},null,"Dmitry L. Valeriavitch (RUS)",3,0,3,0,1,27,-26,0]
[{"$f":"$C18","v":"Dmitry L. Valeriavitch (RUS)"},{"$f":"IF('Séries individuels'!D356=\"\",\"\",'Séries individuels'!D356)","v":0},"-",{"$f":"IF('Séries individuels'!F356=\"\",\"\",'Séries individuels'!F356)","v":9},{"$f":"$D18","v":"Luis Abreu (POR)"},null,null,null,{"$f":"SUM(I226:I229)","v":5},{"$f":"SUM(J226:J229)","v":5},{"$f":"SUM(K226:K229)","v":2},{"$f":"SUM(L226:L229)","v":49},{"$f":"SUM(M226:M229)","v":49},{"$f":"SUM(N226:N229)","v":0}]
[]
[]
["Veteran category"]
[]
["Group 1"]
[]
[{"$f":"$B22","v":"Antonio Montaño (ESP)"},{"$f":"IF('Séries individuels'!D22=\"\",\"\",'Séries individuels'!D22)","v":0},"-",{"$f":"IF('Séries individuels'!F22=\"\",\"\",'Séries individuels'!F22)","v":1},{"$f":"$C22","v":"Patrick Dean (GIB)"},null,null,"P","W","L","N","+","-","d","PTS",null,null,"P","W","L","N","+","-","d","PTS"]
[{"$f":"$D22","v":"Dario Passadore (USA)"},{"$f":"IF('Séries individuels'!D23=\"\",\"\",'Séries individuels'!D23)","v":1},"-",{"$f":"IF('Séries individuels'!F23=\"\",\"\",'Séries individuels'!F23)","v":6},{"$f":"$E22","v":"Francesco Mattiangeli (ITA)"},null,{"$f":"A237","v":"Antonio Montaño (ESP)"},{"$f":"IF(B237=\"\",0,1)+IF(B239=\"\",0,1)+IF(D241=\"\",0,1)","v":3},{"$f":"IF(B237>D237,1,0)+IF(B239>D239,1,0)+IF(D241>B241,1,0)","v":1},{"$f":"IF(B237<D237,1,0)+IF(B239<D239,1,0)+IF(D241<B241,1,0)","v":1},{"$f":"IF(B237=\"\",0,IF(B237=D237,1,0))+IF(B239=\"\",0,IF(B239=D239,1,0))+IF(B241=\"\",0,IF(B241=D241,1,0))","v":1},{"$f":"IF(B237=\"\",0,+B237)+IF(B239=\"\",0,+B239)+IF(D241=\"\",0,+D241)","v":7},{"$f":"IF(D237=\"\",0,+D237)+IF(D239=\"\",0,+D239)+IF(B241=\"\",0,+B241)","v":3},{"$f":"L238-M238","v":4},{"$f":"I238*3+K238","v":4},null,"Francesco Mattiangeli (ITA)",3,2,0,1,10,2,8,7]
[{"$f":"$B22","v":"Antonio Montaño (ESP)"},{"$f":"IF('Séries individuels'!D156=\"\",\"\",'Séries individuels'!D156)","v":6},"-",{"$f":"IF('Séries individuels'!F156=\"\",\"\",'Séries individuels'!F156)","v":1},{"$f":"$D22","v":"Dario Passadore (USA)"},null,{"$f":"E237","v":"Patrick Dean (GIB)"},{"$f":"IF(D237=\"\",0,1)+IF(B240=\"\",0,1)+IF(B242=\"\",0,1)","v":3},{"$f":"IF(D237>B237,1,0)+IF(B240>D240,1,0)+IF(B242>D242,1,0)","v":1},{"$f":"IF(D237<B237,1,0)+IF(B240<D240,1,0)+IF(B242<D242,1,0)","v":2},{"$f":"IF(B237=\"\",0,IF(B237=D237,1,0))+IF(B240=\"\",0,IF(B240=D240,1,0))+IF(B242=\"\",0,IF(B242=D242,1,0))","v":0},{"$f":"IF(D237=\"\",0,+D237)+IF(B240=\"\",0,+B240)+IF(B242=\"\",0,+B242)","v":2},{"$f":"IF(B237=\"\",0,+B237)+IF(D240=\"\",0,+D240)+IF(D242=\"\",0,+D242)","v":5},{"$f":"L239-M239","v":-3},{"$f":"I239*3+K239","v":3},null,"Antonio Montaño (ESP)",3,1,1,1,7,3,4,4]
[{"$f":"$C22","v":"Patrick Dean (GIB)"},{"$f":"IF('Séries individuels'!D157=\"\",\"\",'Séries individuels'!D157)","v":0},"-",{"$f":"IF('Séries individuels'!F157=\"\",\"\",'Séries individuels'!F157)","v":3},{"$f":"$E22","v":"Francesco Mattiangeli (ITA)"},null,{"$f":"A238","v":"Dario Passadore (USA)"},{"$f":"IF(B238=\"\",0,1)+IF(D239=\"\",0,1)+IF(D242=\"\",0,1)","v":3},{"$f":"IF(B238>D238,1,0)+IF(D239>B239,1,0)+IF(D242>B242,1,0)","v":1},{"$f":"IF(B238<D238,1,0)+IF(D239<B239,1,0)+IF(D242<B242,1,0)","v":2},{"$f":"IF(B238=\"\",0,IF(B238=D238,1,0))+IF(B239=\"\",0,IF(B239=D239,1,0))+IF(B242=\"\",0,IF(B242=D242,1,0))","v":0},{"$f":"IF(B238=\"\",0,+B238)+IF(D239=\"\",0,+D239)+IF(D242=\"\",0,+D242)","v":4},{"$f":"IF(D238=\"\",0,+D238)+IF(B239=\"\",0,+B239)+IF(B242=\"\",0,+B242)","v":13},{"$f":"L240-M240","v":-9},{"$f":"I240*3+K240","v":3},null,"Patrick Dean (GIB)",3,1,2,0,2,5,-3,3]
[{"$f":"$E22","v":"Francesco Mattiangeli (ITA)"},{"$f":"IF('Séries individuels'!D290=\"\",\"\",'Séries individuels'!D290)","v":1},"-",{"$f":"IF('Séries individuels'!F290=\"\",\"\",'Séries individuels'!F290)","v":1},{"$f":"$B22","v":"Antonio Montaño (ESP)"},null,{"$f":"E238","v":"Francesco Mattiangeli (ITA)"},{"$f":"IF(D238=\"\",0,1)+IF(D240=\"\",0,1)+IF(B241=\"\",0,1)","v":3},{"$f":"IF(D238>B238,1,0)+IF(D240>B240,1,0)+IF(B241>D241,1,0)","v":2},{"$f":"IF(D238<B238,1,0)+IF(D240<B240,1,0)+IF(B241<D241,1,0)","v":0},{"$f":"IF(B238=\"\",0,IF(B238=D238,1,0))+IF(B240=\"\",0,IF(B240=D240,1,0))+IF(B241=\"\",0,IF(B241=D241,1,0))","v":1},{"$f":"IF(D238=\"\",0,+D238)+IF(D240=\"\",0,+D240)+IF(B241=\"\",0,+B241)","v":10},{"$f":"IF(B238=\"\",0,+B238)+IF(B240=\"\",0,+B240)+IF(D241=\"\",0,+D241)","v":2},{"$f":"L241-M241","v":8},{"$f":"I241*3+K241","v":7},null,"Dario Passadore (USA)",3,1,2,0,4,13,-9,3]
[{"$f":"$C22","v":"Patrick Dean (GIB)"},{"$f":"IF('Séries individuels'!D291=\"\",\"\",'Séries individuels'!D291)","v":1},"-",{"$f":"IF('Séries individuels'!F291=\"\",\"\",'Séries individuels'!F291)","v":2},{"$f":"$D22","v":"Dario Passadore (USA)"},null,null,null,{"$f":"SUM(I238:I241)","v":5},{"$f":"SUM(J238:J241)","v":5},{"$f":"SUM(K238:K241)","v":2},{"$f":"SUM(L238:L241)","v":23},{"$f":"SUM(M238:M241)","v":23},{"$f":"SUM(N238:N241)","v":0}]
[]
["Group 2"]
[]
[{"$f":"$B23","v":"Pascal Scheen (BEL)"},{"$f":"IF('Séries individuels'!D24=\"\",\"\",'Séries individuels'!D24)","v":7},"-",{"$f":"IF('Séries individuels'!F24=\"\",\"\",'Séries individuels'!F24)","v":0},{"$f":"$C23","v":"Mat Atkin (ENG)"},null,null,"P","W","L","N","+","-","d","PTS",null,null,"P","W","L","N","+","-","d","PTS"]
[{"$f":"$D23","v":"Panagiotis Haratsis (GRE)"},{"$f":"IF('Séries individuels'!D25=\"\",\"\",'Séries individuels'!D25)","v":5},"-",{"$f":"IF('Séries individuels'!F25=\"\",\"\",'Séries individuels'!F25)","v":0},{"$f":"$E23","v":"Andreas Jung (GER)"},null,{"$f":"A246","v":"Pascal Scheen (BEL)"},{"$f":"IF(B246=\"\",0,1)+IF(B248=\"\",0,1)+IF(D250=\"\",0,1)","v":3},{"$f":"IF(B246>D246,1,0)+IF(B248>D248,1,0)+IF(D250>B250,1,0)","v":3},{"$f":"IF(B246<D246,1,0)+IF(B248<D248,1,0)+IF(D250<B250,1,0)","v":0},{"$f":"IF(B246=\"\",0,IF(B246=D246,1,0))+IF(B248=\"\",0,IF(B248=D248,1,0))+IF(B250=\"\",0,IF(B250=D250,1,0))","v":0},{"$f":"IF(B246=\"\",0,+B246)+IF(B248=\"\",0,+B248)+IF(D250=\"\",0,+D250)","v":14},{"$f":"IF(D246=\"\",0,+D246)+IF(D248=\"\",0,+D248)+IF(B250=\"\",0,+B250)","v":4},{"$f":"L247-M247","v":10},{"$f":"I247*3+K247","v":9},null,"Pascal Scheen (BEL)",3,3,0,0,14,4,10,9]
[{"$f":"$B23","v":"Pascal Scheen (BEL)"},{"$f":"IF('Séries individuels'!D158=\"\",\"\",'Séries individuels'!D158)","v":3},"-",{"$f":"IF('Séries individuels'!F158=\"\",\"\",'Séries individuels'!F158)","v":2},{"$f":"$D23","v":"Panagiotis Haratsis (GRE)"},null,{"$f":"E246","v":"Mat Atkin (ENG)"},{"$f":"IF(D246=\"\",0,1)+IF(B249=\"\",0,1)+IF(B251=\"\",0,1)","v":3},{"$f":"IF(D246>B246,1,0)+IF(B249>D249,1,0)+IF(B251>D251,1,0)","v":0},{"$f":"IF(D246<B246,1,0)+IF(B249<D249,1,0)+IF(B251<D251,1,0)","v":3},{"$f":"IF(B246=\"\",0,IF(B246=D246,1,0))+IF(B249=\"\",0,IF(B249=D249,1,0))+IF(B251=\"\",0,IF(B251=D251,1,0))","v":0},{"$f":"IF(D246=\"\",0,+D246)+IF(B249=\"\",0,+B249)+IF(B251=\"\",0,+B251)","v":1},{"$f":"IF(B246=\"\",0,+B246)+IF(D249=\"\",0,+D249)+IF(D251=\"\",0,+D251)","v":16},{"$f":"L248-M248","v":-15},{"$f":"I248*3+K248","v":0},null,"Panagiotis Haratsis (GRE)",3,2,1,0,12,3,9,6]
[{"$f":"$C23","v":"Mat Atkin (ENG)"},{"$f":"IF('Séries individuels'!D159=\"\",\"\",'Séries individuels'!D159)","v":1},"-",{"$f":"IF('Séries individuels'!F159=\"\",\"\",'Séries individuels'!F159)","v":4},{"$f":"$E23","v":"Andreas Jung (GER)"},null,{"$f":"A247","v":"Panagiotis Haratsis (GRE)"},{"$f":"IF(B247=\"\",0,1)+IF(D248=\"\",0,1)+IF(D251=\"\",0,1)","v":3},{"$f":"IF(B247>D247,1,0)+IF(D248>B248,1,0)+IF(D251>B251,1,0)","v":2},{"$f":"IF(B247<D247,1,0)+IF(D248<B248,1,0)+IF(D251<B251,1,0)","v":1},{"$f":"IF(B247=\"\",0,IF(B247=D247,1,0))+IF(B248=\"\",0,IF(B248=D248,1,0))+IF(B251=\"\",0,IF(B251=D251,1,0))","v":0},{"$f":"IF(B247=\"\",0,+B247)+IF(D248=\"\",0,+D248)+IF(D251=\"\",0,+D251)","v":12},{"$f":"IF(D247=\"\",0,+D247)+IF(B248=\"\",0,+B248)+IF(B251=\"\",0,+B251)","v":3},{"$f":"L249-M249","v":9},{"$f":"I249*3+K249","v":6},null,"Andreas Jung (GER)",3,1,2,0,6,10,-4,3]
[{"$f":"$E23","v":"Andreas Jung (GER)"},{"$f":"IF('Séries individuels'!D292=\"\",\"\",'Séries individuels'!D292)","v":2},"-",{"$f":"IF('Séries individuels'!F292=\"\",\"\",'Séries individuels'!F292)","v":4},{"$f":"$B23","v":"Pascal Scheen (BEL)"},null,{"$f":"E247","v":"Andreas Jung (GER)"},{"$f":"IF(D247=\"\",0,1)+IF(D249=\"\",0,1)+IF(B250=\"\",0,1)","v":3},{"$f":"IF(D247>B247,1,0)+IF(D249>B249,1,0)+IF(B250>D250,1,0)","v":1},{"$f":"IF(D247<B247,1,0)+IF(D249<B249,1,0)+IF(B250<D250,1,0)","v":2},{"$f":"IF(B247=\"\",0,IF(B247=D247,1,0))+IF(B249=\"\",0,IF(B249=D249,1,0))+IF(B250=\"\",0,IF(B250=D250,1,0))","v":0},{"$f":"IF(D247=\"\",0,+D247)+IF(D249=\"\",0,+D249)+IF(B250=\"\",0,+B250)","v":6},{"$f":"IF(B247=\"\",0,+B247)+IF(B249=\"\",0,+B249)+IF(D250=\"\",0,+D250)","v":10},{"$f":"L250-M250","v":-4},{"$f":"I250*3+K250","v":3},null,"Mat Atkin (ENG)",3,0,3,0,1,16,-15,0]
[{"$f":"$C23","v":"Mat Atkin (ENG)"},{"$f":"IF('Séries individuels'!D293=\"\",\"\",'Séries individuels'!D293)","v":0},"-",{"$f":"IF('Séries individuels'!F293=\"\",\"\",'Séries individuels'!F293)","v":5},{"$f":"$D23","v":"Panagiotis Haratsis (GRE)"},null,null,null,{"$f":"SUM(I247:I250)","v":6},{"$f":"SUM(J247:J250)","v":6},{"$f":"SUM(K247:K250)","v":0},{"$f":"SUM(L247:L250)","v":33},{"$f":"SUM(M247:M250)","v":33},{"$f":"SUM(N247:N250)","v":0}]
[]
["Group 3"]
[]
[{"$f":"$B24","v":"Vicenç Prats Salat (ESP)"},{"$f":"IF('Séries individuels'!D26=\"\",\"\",'Séries individuels'!D26)","v":2},"-",{"$f":"IF('Séries individuels'!F26=\"\",\"\",'Séries individuels'!F26)","v":2},{"$f":"$C24","v":"Frank Stiller (GER)"},null,null,"P","W","L","N","+","-","d","PTS",null,null,"P","W","L","N","+","-","d","PTS"]
[{"$f":"$D24","v":"Henk Landzaat (NED)"},{"$f":"IF('Séries individuels'!D27=\"\",\"\",'Séries individuels'!D27)","v":1},"-",{"$f":"IF('Séries individuels'!F27=\"\",\"\",'Séries individuels'!F27)","v":1},{"$f":"$E24","v":"Paul Eyes (USA)"},null,{"$f":"A255","v":"Vicenç Prats Salat (ESP)"},{"$f":"IF(B255=\"\",0,1)+IF(B257=\"\",0,1)+IF(D259=\"\",0,1)","v":3},{"$f":"IF(B255>D255,1,0)+IF(B257>D257,1,0)+IF(D259>B259,1,0)","v":2},{"$f":"IF(B255<D255,1,0)+IF(B257<D257,1,0)+IF(D259<B259,1,0)","v":0},{"$f":"IF(B255=\"\",0,IF(B255=D255,1,0))+IF(B257=\"\",0,IF(B257=D257,1,0))+IF(B259=\"\",0,IF(B259=D259,1,0))","v":1},{"$f":"IF(B255=\"\",0,+B255)+IF(B257=\"\",0,+B257)+IF(D259=\"\",0,+D259)","v":12},{"$f":"IF(D255=\"\",0,+D255)+IF(D257=\"\",0,+D257)+IF(B259=\"\",0,+B259)","v":4},{"$f":"L256-M256","v":8},{"$f":"I256*3+K256","v":7},null,"Vicenç Prats Salat (ESP)",3,2,0,1,12,4,8,7]
[{"$f":"$B24","v":"Vicenç Prats Salat (ESP)"},{"$f":"IF('Séries individuels'!D160=\"\",\"\",'Séries individuels'!D160)","v":6},"-",{"$f":"IF('Séries individuels'!F160=\"\",\"\",'Séries individuels'!F160)","v":1},{"$f":"$D24","v":"Henk Landzaat (NED)"},null,{"$f":"E255","v":"Frank Stiller (GER)"},{"$f":"IF(D255=\"\",0,1)+IF(B258=\"\",0,1)+IF(B260=\"\",0,1)","v":3},{"$f":"IF(D255>B255,1,0)+IF(B258>D258,1,0)+IF(B260>D260,1,0)","v":2},{"$f":"IF(D255<B255,1,0)+IF(B258<D258,1,0)+IF(B260<D260,1,0)","v":0},{"$f":"IF(B255=\"\",0,IF(B255=D255,1,0))+IF(B258=\"\",0,IF(B258=D258,1,0))+IF(B260=\"\",0,IF(B260=D260,1,0))","v":1},{"$f":"IF(D255=\"\",0,+D255)+IF(B258=\"\",0,+B258)+IF(B260=\"\",0,+B260)","v":8},{"$f":"IF(B255=\"\",0,+B255)+IF(D258=\"\",0,+D258)+IF(D260=\"\",0,+D260)","v":3},{"$f":"L257-M257","v":5},{"$f":"I257*3+K257","v":7},null,"Frank Stiller (GER)",3,2,0,1,8,3,5,7]
[{"$f":"$C24","v":"Frank Stiller (GER)"},{"$f":"IF('Séries individuels'!D161=\"\",\"\",'Séries individuels'!D161)","v":2},"-",{"$f":"IF('Séries individuels'!F161=\"\",\"\",'Séries individuels'!F161)","v":0},{"$f":"$E24","v":"Paul Eyes (USA)"},null,{"$f":"A256","v":"Henk Landzaat (NED)"},{"$f":"IF(B256=\"\",0,1)+IF(D257=\"\",0,1)+IF(D260=\"\",0,1)","v":3},{"$f":"IF(B256>D256,1,0)+IF(D257>B257,1,0)+IF(D260>B260,1,0)","v":0},{"$f":"IF(B256<D256,1,0)+IF(D257<B257,1,0)+IF(D260<B260,1,0)","v":2},{"$f":"IF(B256=\"\",0,IF(B256=D256,1,0))+IF(B257=\"\",0,IF(B257=D257,1,0))+IF(B260=\"\",0,IF(B260=D260,1,0))","v":1},{"$f":"IF(B256=\"\",0,+B256)+IF(D257=\"\",0,+D257)+IF(D260=\"\",0,+D260)","v":3},{"$f":"IF(D256=\"\",0,+D256)+IF(B257=\"\",0,+B257)+IF(B260=\"\",0,+B260)","v":11},{"$f":"L258-M258","v":-8},{"$f":"I258*3+K258","v":1},null,"Paul Eyes (USA)",3,0,2,1,2,7,-5,1]
[{"$f":"$E24","v":"Paul Eyes (USA)"},{"$f":"IF('Séries individuels'!D294=\"\",\"\",'Séries individuels'!D294)","v":1},"-",{"$f":"IF('Séries individuels'!F294=\"\",\"\",'Séries individuels'!F294)","v":4},{"$f":"$B24","v":"Vicenç Prats Salat (ESP)"},null,{"$f":"E256","v":"Paul Eyes (USA)"},{"$f":"IF(D256=\"\",0,1)+IF(D258=\"\",0,1)+IF(B259=\"\",0,1)","v":3},{"$f":"IF(D256>B256,1,0)+IF(D258>B258,1,0)+IF(B259>D259,1,0)","v":0},{"$f":"IF(D256<B256,1,0)+IF(D258<B258,1,0)+IF(B259<D259,1,0)","v":2},{"$f":"IF(B256=\"\",0,IF(B256=D256,1,0))+IF(B258=\"\",0,IF(B258=D258,1,0))+IF(B259=\"\",0,IF(B259=D259,1,0))","v":1},{"$f":"IF(D256=\"\",0,+D256)+IF(D258=\"\",0,+D258)+IF(B259=\"\",0,+B259)","v":2},{"$f":"IF(B256=\"\",0,+B256)+IF(B258=\"\",0,+B258)+IF(D259=\"\",0,+D259)","v":7},{"$f":"L259-M259","v":-5},{"$f":"I259*3+K259","v":1},null,"Henk Landzaat (NED)",3,0,2,1,3,11,-8,1]
[{"$f":"$C24","v":"Frank Stiller (GER)"},{"$f":"IF('Séries individuels'!D295=\"\",\"\",'Séries individuels'!D295)","v":4},"-",{"$f":"IF('Séries individuels'!F295=\"\",\"\",'Séries individuels'!F295)","v":1},{"$f":"$D24","v":"Henk Landzaat (NED)"},null,null,null,{"$f":"SUM(I256:I259)","v":4},{"$f":"SUM(J256:J259)","v":4},{"$f":"SUM(K256:K259)","v":4},{"$f":"SUM(L256:L259)","v":25},{"$f":"SUM(M256:M259)","v":25},{"$f":"SUM(N256:N259)","v":0}]
[]
["Group 4"]
[]
[{"$f":"$B25","v":"Daniel Scheen (BEL)"},{"$f":"IF('Séries individuels'!D28=\"\",\"\",'Séries individuels'!D28)","v":5},"-",{"$f":"IF('Séries individuels'!F28=\"\",\"\",'Séries individuels'!F28)","v":2},{"$f":"$C25","v":"Karl-Heinz Haider (AUT)"},null,null,"P","W","L","N","+","-","d","PTS",null,null,"P","W","L","N","+","-","d","PTS"]
[{"$f":"$D25","v":"Richard Berllaque (GIB)"},{"$f":"IF('Séries individuels'!D29=\"\",\"\",'Séries individuels'!D29)","v":0},"-",{"$f":"IF('Séries individuels'!F29=\"\",\"\",'Séries individuels'!F29)","v":3},{"$f":"$E25","v":"Jeremy Bradley (ENG)"},null,{"$f":"A264","v":"Daniel Scheen (BEL)"},{"$f":"IF(B264=\"\",0,1)+IF(B266=\"\",0,1)+IF(D268=\"\",0,1)","v":3},{"$f":"IF(B264>D264,1,0)+IF(B266>D266,1,0)+IF(D268>B268,1,0)","v":3},{"$f":"IF(B264<D264,1,0)+IF(B266<D266,1,0)+IF(D268<B268,1,0)","v":0},{"$f":"IF(B264=\"\",0,IF(B264=D264,1,0))+IF(B266=\"\",0,IF(B266=D266,1,0))+IF(B268=\"\",0,IF(B268=D268,1,0))","v":0},{"$f":"IF(B264=\"\",0,+B264)+IF(B266=\"\",0,+B266)+IF(D268=\"\",0,+D268)","v":15},{"$f":"IF(D264=\"\",0,+D264)+IF(D266=\"\",0,+D266)+IF(B268=\"\",0,+B268)","v":2},{"$f":"L265-M265","v":13},{"$f":"I265*3+K265","v":9},null,"Daniel Scheen (BEL)",3,3,0,0,15,2,13,9]
[{"$f":"$B25","v":"Daniel Scheen (BEL)"},{"$f":"IF('Séries individuels'!D162=\"\",\"\",'Séries individuels'!D162)","v":9},"-",{"$f":"IF('Séries individuels'!F162=\"\",\"\",'Séries individuels'!F162)","v":0},{"$f":"$D25","v":"Richard Berllaque (GIB)"},null,{"$f":"E264","v":"Karl-Heinz Haider (AUT)"},{"$f":"IF(D264=\"\",0,1)+IF(B267=\"\",0,1)+IF(B269=\"\",0,1)","v":3},{"$f":"IF(D264>B264,1,0)+IF(B267>D267,1,0)+IF(B269>D269,1,0)","v":1},{"$f":"IF(D264<B264,1,0)+IF(B267<D267,1,0)+IF(B269<D269,1,0)","v":1},{"$f":"IF(B264=\"\",0,IF(B264=D264,1,0))+IF(B267=\"\",0,IF(B267=D267,1,0))+IF(B269=\"\",0,IF(B269=D269,1,0))","v":1},{"$f":"IF(D264=\"\",0,+D264)+IF(B267=\"\",0,+B267)+IF(B269=\"\",0,+B269)","v":9},{"$f":"IF(B264=\"\",0,+B264)+IF(D267=\"\",0,+D267)+IF(D269=\"\",0,+D269)","v":7},{"$f":"L266-M266","v":2},{"$f":"I266*3+K266","v":4},null,"Karl-Heinz Haider (AUT)",3,1,1,1,9,7,2,4]
[{"$f":"$C25","v":"Karl-Heinz Haider (AUT)"},{"$f":"IF('Séries individuels'!D163=\"\",\"\",'Séries individuels'!D163)","v":2},"-",{"$f":"IF('Séries individuels'!F163=\"\",\"\",'Séries individuels'!F163)","v":2},{"$f":"$E25","v":"Jeremy Bradley (ENG)"},null,{"$f":"A265","v":"Richard Berllaque (GIB)"},{"$f":"IF(B265=\"\",0,1)+IF(D266=\"\",0,1)+IF(D269=\"\",0,1)","v":3},{"$f":"IF(B265>D265,1,0)+IF(D266>B266,1,0)+IF(D269>B269,1,0)","v":0},{"$f":"IF(B265<D265,1,0)+IF(D266<B266,1,0)+IF(D269<B269,1,0)","v":3},{"$f":"IF(B265=\"\",0,IF(B265=D265,1,0))+IF(B266=\"\",0,IF(B266=D266,1,0))+IF(B269=\"\",0,IF(B269=D269,1,0))","v":0},{"$f":"IF(B265=\"\",0,+B265)+IF(D266=\"\",0,+D266)+IF(D269=\"\",0,+D269)","v":0},{"$f":"IF(D265=\"\",0,+D265)+IF(B266=\"\",0,+B266)+IF(B269=\"\",0,+B269)","v":17},{"$f":"L267-M267","v":-17},{"$f":"I267*3+K267","v":0},null,"Jeremy Bradley (ENG)",3,1,1,1,5,3,2,4]
[{"$f":"$E25","v":"Jeremy Bradley (ENG)"},{"$f":"IF('Séries individuels'!D296=\"\",\"\",'Séries individuels'!D296)","v":0},"-",{"$f":"IF('Séries individuels'!F296=\"\",\"\",'Séries individuels'!F296)","v":1},{"$f":"$B25","v":"Daniel Scheen (BEL)"},null,{"$f":"E265","v":"Jeremy Bradley (ENG)"},{"$f":"IF(D265=\"\",0,1)+IF(D267=\"\",0,1)+IF(B268=\"\",0,1)","v":3},{"$f":"IF(D265>B265,1,0)+IF(D267>B267,1,0)+IF(B268>D268,1,0)","v":1},{"$f":"IF(D265<B265,1,0)+IF(D267<B267,1,0)+IF(B268<D268,1,0)","v":1},{"$f":"IF(B265=\"\",0,IF(B265=D265,1,0))+IF(B267=\"\",0,IF(B267=D267,1,0))+IF(B268=\"\",0,IF(B268=D268,1,0))","v":1},{"$f":"IF(D265=\"\",0,+D265)+IF(D267=\"\",0,+D267)+IF(B268=\"\",0,+B268)","v":5},{"$f":"IF(B265=\"\",0,+B265)+IF(B267=\"\",0,+B267)+IF(D268=\"\",0,+D268)","v":3},{"$f":"L268-M268","v":2},{"$f":"I268*3+K268","v":4},null,"Richard Berllaque (GIB)",3,0,3,0,0,17,-17,0]
[{"$f":"$C25","v":"Karl-Heinz Haider (AUT)"},{"$f":"IF('Séries individuels'!D297=\"\",\"\",'Séries individuels'!D297)","v":5},"-",{"$f":"IF('Séries individuels'!F297=\"\",\"\",'Séries individuels'!F297)","v":0},{"$f":"$D25","v":"Richard Berllaque (GIB)"},null,null,null,{"$f":"SUM(I265:I268)","v":5},{"$f":"SUM(J265:J268)","v":5},{"$f":"SUM(K265:K268)","v":2},{"$f":"SUM(L265:L268)","v":29},{"$f":"SUM(M265:M268)","v":29},{"$f":"SUM(N265:N268)","v":0}]
[]
["Group 5"]
[]
[{"$f":"$B26","v":"Günther Bamberzky (AUT)"},{"$f":"IF('Séries individuels'!D30=\"\",\"\",'Séries individuels'!D30)","v":2},"-",{"$f":"IF('Séries individuels'!F30=\"\",\"\",'Séries individuels'!F30)","v":0},{"$f":"$C26","v":"Xavier Dubois (FRA)"},null,null,"P","W","L","N","+","-","d","PTS",null,null,"P","W","L","N","+","-","d","PTS"]
[{"$f":"$D26","v":"Paul O’Donovan Rossa (USA)"},{"$f":"IF('Séries individuels'!D31=\"\",\"\",'Séries individuels'!D31)","v":0},"-",{"$f":"IF('Séries individuels'!F31=\"\",\"\",'Séries individuels'!F31)","v":2},{"$f":"$E26","v":"Phil Redman (ENG)"},null,{"$f":"A273","v":"Günther Bamberzky (AUT)"},{"$f":"IF(B273=\"\",0,1)+IF(B275=\"\",0,1)+IF(D277=\"\",0,1)","v":3},{"$f":"IF(B273>D273,1,0)+IF(B275>D275,1,0)+IF(D277>B277,1,0)","v":3},{"$f":"IF(B273<D273,1,0)+IF(B275<D275,1,0)+IF(D277<B277,1,0)","v":0},{"$f":"IF(B273=\"\",0,IF(B273=D273,1,0))+IF(B275=\"\",0,IF(B275=D275,1,0))+IF(B277=\"\",0,IF(B277=D277,1,0))","v":0},{"$f":"IF(B273=\"\",0,+B273)+IF(B275=\"\",0,+B275)+IF(D277=\"\",0,+D277)","v":6},{"$f":"IF(D273=\"\",0,+D273)+IF(D275=\"\",0,+D275)+IF(B277=\"\",0,+B277)","v":0},{"$f":"L274-M274","v":6},{"$f":"I274*3+K274","v":9},null,"Günther Bamberzky (AUT)",3,3,0,0,6,0,6,9]
[{"$f":"$B26","v":"Günther Bamberzky (AUT)"},{"$f":"IF('Séries individuels'!D164=\"\",\"\",'Séries individuels'!D164)","v":2},"-",{"$f":"IF('Séries individuels'!F164=\"\",\"\",'Séries individuels'!F164)","v":0},{"$f":"$D26","v":"Paul O’Donovan Rossa (USA)"},null,{"$f":"E273","v":"Xavier Dubois (FRA)"},{"$f":"IF(D273=\"\",0,1)+IF(B276=\"\",0,1)+IF(B278=\"\",0,1)","v":3},{"$f":"IF(D273>B273,1,0)+IF(B276>D276,1,0)+IF(B278>D278,1,0)","v":1},{"$f":"IF(D273<B273,1,0)+IF(B276<D276,1,0)+IF(B278<D278,1,0)","v":1},{"$f":"IF(B273=\"\",0,IF(B273=D273,1,0))+IF(B276=\"\",0,IF(B276=D276,1,0))+IF(B278=\"\",0,IF(B278=D278,1,0))","v":1},{"$f":"IF(D273=\"\",0,+D273)+IF(B276=\"\",0,+B276)+IF(B278=\"\",0,+B278)","v":2},{"$f":"IF(B273=\"\",0,+B273)+IF(D276=\"\",0,+D276)+IF(D278=\"\",0,+D278)","v":3},{"$f":"L275-M275","v":-1},{"$f":"I275*3+K275","v":4},null,"Phil Redman (ENG)",3,1,1,1,3,3,0,4]
[{"$f":"$C26","v":"Xavier Dubois (FRA)"},{"$f":"IF('Séries individuels'!D165=\"\",\"\",'Séries individuels'!D165)","v":1},"-",{"$f":"IF('Séries individuels'!F165=\"\",\"\",'Séries individuels'!F165)","v":1},{"$f":"$E26","v":"Phil Redman (ENG)"},null,{"$f":"A274","v":"Paul O’Donovan Rossa (USA)"},{"$f":"IF(B274=\"\",0,1)+IF(D275=\"\",0,1)+IF(D278=\"\",0,1)","v":3},{"$f":"IF(B274>D274,1,0)+IF(D275>B275,1,0)+IF(D278>B278,1,0)","v":0},{"$f":"IF(B274<D274,1,0)+IF(D275<B275,1,0)+IF(D278<B278,1,0)","v":3},{"$f":"IF(B274=\"\",0,IF(B274=D274,1,0))+IF(B275=\"\",0,IF(B275=D275,1,0))+IF(B278=\"\",0,IF(B278=D278,1,0))","v":0},{"$f":"IF(B274=\"\",0,+B274)+IF(D275=\"\",0,+D275)+IF(D278=\"\",0,+D278)","v":0},{"$f":"IF(D274=\"\",0,+D274)+IF(B275=\"\",0,+B275)+IF(B278=\"\",0,+B278)","v":5},{"$f":"L276-M276","v":-5},{"$f":"I276*3+K276","v":0},null,"Xavier Dubois (FRA)",3,1,1,1,2,3,-1,4]
[{"$f":"$E26","v":"Phil Redman (ENG)"},{"$f":"IF('Séries individuels'!D298=\"\",\"\",'Séries individuels'!D298)","v":0},"-",{"$f":"IF('Séries individuels'!F298=\"\",\"\",'Séries individuels'!F298)","v":2},{"$f":"$B26","v":"Günther Bamberzky (AUT)"},null,{"$f":"E274","v":"Phil Redman (ENG)"},{"$f":"IF(D274=\"\",0,1)+IF(D276=\"\",0,1)+IF(B277=\"\",0,1)","v":3},{"$f":"IF(D274>B274,1,0)+IF(D276>B276,1,0)+IF(B277>D277,1,0)","v":1},{"$f":"IF(D274<B274,1,0)+IF(D276<B276,1,0)+IF(B277<D277,1,0)","v":1},{"$f":"IF(B274=\"\",0,IF(B274=D274,1,0))+IF(B276=\"\",0,IF(B276=D276,1,0))+IF(B277=\"\",0,IF(B277=D277,1,0))","v":1},{"$f":"IF(D274=\"\",0,+D274)+IF(D276=\"\",0,+D276)+IF(B277=\"\",0,+B277)","v":3},{"$f":"IF(B274=\"\",0,+B274)+IF(B276=\"\",0,+B276)+IF(D277=\"\",0,+D277)","v":3},{"$f":"L277-M277","v":0},{"$f":"I277*3+K277","v":4},null,"Paul O’Donovan Rossa (USA)",3,0,3,0,0,5,-5,0]
[{"$f":"$C26","v":"Xavier Dubois (FRA)"},{"$f":"IF('Séries individuels'!D299=\"\",\"\",'Séries individuels'!D299)","v":1},"-",{"$f":"IF('Séries individuels'!F299=\"\",\"\",'Séries individuels'!F299)","v":0},{"$f":"$D26","v":"Paul O’Donovan Rossa (USA)"},null,null,null,{"$f":"SUM(I274:I277)","v":5},{"$f":"SUM(J274:J277)","v":5},{"$f":"SUM(K274:K277)","v":2},{"$f":"SUM(L274:L277)","v":11},{"$f":"SUM(M274:M277)","v":11},{"$f":"SUM(N274:N277)","v":0}]
[]
["Group 6"]
[]
[{"$f":"$B27","v":"Gianfranco Calonico (ITA)"},{"$f":"IF('Séries individuels'!D32=\"\",\"\",'Séries individuels'!D32)","v":2},"-",{"$f":"IF('Séries individuels'!F32=\"\",\"\",'Séries individuels'!F32)","v":1},{"$f":"$C27","v":"Arturo Martínez (ESP)"},null,null,"P","W","L","N","+","-","d","PTS",null,null,"P","W","L","N","+","-","d","PTS"]
[{"$f":"$D27","v":"Axel Modeste (FRA)"},{"$f":"IF('Séries individuels'!D33=\"\",\"\",'Séries individuels'!D33)","v":15},"-",{"$f":"IF('Séries individuels'!F33=\"\",\"\",'Séries individuels'!F33)","v":0},{"$f":"$E27","v":"Andrey K. Nicolaevich (RUS)"},null,{"$f":"A282","v":"Gianfranco Calonico (ITA)"},{"$f":"IF(B282=\"\",0,1)+IF(B284=\"\",0,1)+IF(D286=\"\",0,1)","v":3},{"$f":"IF(B282>D282,1,0)+IF(B284>D284,1,0)+IF(D286>B286,1,0)","v":3},{"$f":"IF(B282<D282,1,0)+IF(B284<D284,1,0)+IF(D286<B286,1,0)","v":0},{"$f":"IF(B282=\"\",0,IF(B282=D282,1,0))+IF(B284=\"\",0,IF(B284=D284,1,0))+IF(B286=\"\",0,IF(B286=D286,1,0))","v":0},{"$f":"IF(B282=\"\",0,+B282)+IF(B284=\"\",0,+B284)+IF(D286=\"\",0,+D286)","v":11},{"$f":"IF(D282=\"\",0,+D282)+IF(D284=\"\",0,+D284)+IF(B286=\"\",0,+B286)","v":2},{"$f":"L283-M283","v":9},{"$f":"I283*3+K283","v":9},null,"Gianfranco Calonico (ITA)",3,3,0,0,11,2,9,9]
[{"$f":"$B27","v":"Gianfranco Calonico (ITA)"},{"$f":"IF('Séries individuels'!D166=\"\",\"\",'Séries individuels'!D166)","v":4},"-",{"$f":"IF('Séries individuels'!F166=\"\",\"\",'Séries individuels'!F166)","v":1},{"$f":"$D27","v":"Axel Modeste (FRA)"},null,{"$f":"E282","v":"Arturo Martínez (ESP)"},{"$f":"IF(D282=\"\",0,1)+IF(B285=\"\",0,1)+IF(B287=\"\",0,1)","v":3},{"$f":"IF(D282>B282,1,0)+IF(B285>D285,1,0)+IF(B287>D287,1,0)","v":1},{"$f":"IF(D282<B282,1,0)+IF(B285<D285,1,0)+IF(B287<D287,1,0)","v":1},{"$f":"IF(B282=\"\",0,IF(B282=D282,1,0))+IF(B285=\"\",0,IF(B285=D285,1,0))+IF(B287=\"\",0,IF(B287=D287,1,0))","v":1},{"$f":"IF(D282=\"\",0,+D282)+IF(B285=\"\",0,+B285)+IF(B287=\"\",0,+B287)","v":20},{"$f":"IF(B282=\"\",0,+B282)+IF(D285=\"\",0,+D285)+IF(D287=\"\",0,+D287)","v":2},{"$f":"L284-M284","v":18},{"$f":"I284*3+K284","v":4},null,"Arturo Martínez (ESP)",3,1,1,1,20,2,18,4]
[{"$f":"$C27","v":"Arturo Martínez (ESP)"},{"$f":"IF('Séries individuels'!D167=\"\",\"\",'Séries individuels'!D167)","v":19},"-",{"$f":"IF('Séries individuels'!F167=\"\",\"\",'Séries individuels'!F167)","v":0},{"$f":"$E27","v":"Andrey K. Nicolaevich (RUS)"},null,{"$f":"A283","v":"Axel Modeste (FRA)"},{"$f":"IF(B283=\"\",0,1)+IF(D284=\"\",0,1)+IF(D287=\"\",0,1)","v":3},{"$f":"IF(B283>D283,1,0)+IF(D284>B284,1,0)+IF(D287>B287,1,0)","v":1},{"$f":"IF(B283<D283,1,0)+IF(D284<B284,1,0)+IF(D287<B287,1,0)","v":1},{"$f":"IF(B283=\"\",0,IF(B283=D283,1,0))+IF(B284=\"\",0,IF(B284=D284,1,0))+IF(B287=\"\",0,IF(B287=D287,1,0))","v":1},{"$f":"IF(B283=\"\",0,+B283)+IF(D284=\"\",0,+D284)+IF(D287=\"\",0,+D287)","v":16},{"$f":"IF(D283=\"\",0,+D283)+IF(B284=\"\",0,+B284)+IF(B287=\"\",0,+B287)","v":4},{"$f":"L285-M285","v":12},{"$f":"I285*3+K285","v":4},null,"Axel Modeste (FRA)",3,1,1,1,16,4,12,4]
[{"$f":"$E27","v":"Andrey K. Nicolaevich (RUS)"},{"$f":"IF('Séries individuels'!D300=\"\",\"\",'Séries individuels'!D300)","v":0},"-",{"$f":"IF('Séries individuels'!F300=\"\",\"\",'Séries individuels'!F300)","v":5},{"$f":"$B27","v":"Gianfranco Calonico (ITA)"},null,{"$f":"E283","v":"Andrey K. Nicolaevich (RUS)"},{"$f":"IF(D283=\"\",0,1)+IF(D285=\"\",0,1)+IF(B286=\"\",0,1)","v":3},{"$f":"IF(D283>B283,1,0)+IF(D285>B285,1,0)+IF(B286>D286,1,0)","v":0},{"$f":"IF(D283<B283,1,0)+IF(D285<B285,1,0)+IF(B286<D286,1,0)","v":3},{"$f":"IF(B283=\"\",0,IF(B283=D283,1,0))+IF(B285=\"\",0,IF(B285=D285,1,0))+IF(B286=\"\",0,IF(B286=D286,1,0))","v":0},{"$f":"IF(D283=\"\",0,+D283)+IF(D285=\"\",0,+D285)+IF(B286=\"\",0,+B286)","v":0},{"$f":"IF(B283=\"\",0,+B283)+IF(B285=\"\",0,+B285)+IF(D286=\"\",0,+D286)","v":39},{"$f":"L286-M286","v":-39},{"$f":"I286*3+K286","v":0},null,"Andrey K. Nicolaevich (RUS)",3,0,3,0,0,39,-39,0]
[{"$f":"$C27","v":"Arturo Martínez (ESP)"},{"$f":"IF('Séries individuels'!D301=\"\",\"\",'Séries individuels'!D301)","v":0},"-",{"$f":"IF('Séries individuels'!F301=\"\",\"\",'Séries individuels'!F301)","v":0},{"$f":"$D27","v":"Axel Modeste (FRA)"},null,null,null,{"$f":"SUM(I283:I286)","v":5},{"$f":"SUM(J283:J286)","v":5},{"$f":"SUM(K283:K286)","v":2},{"$f":"SUM(L283:L286)","v":47},{"$f":"SUM(M283:M286)","v":47},{"$f":"SUM(N283:N286)","v":0}]
[]
["Group 7"]
[]
[{"$f":"$B28","v":"Erich Hinkelmann (AUT)"},{"$f":"IF('Séries individuels'!D34=\"\",\"\",'Séries individuels'!D34)","v":4},"-",{"$f":"IF('Séries individuels'!F34=\"\",\"\",'Séries individuels'!F34)","v":1},{"$f":"$C28","v":"Davide Lazzari (CZE)"},null,null,"P","W","L","N","+","-","d","PTS",null,null,"P","W","L","N","+","-","d","PTS"]
[{"$f":"$D28","v":"Benoît Massart (BEL)"},{"$f":"IF('Séries individuels'!D35=\"\",\"\",'Séries individuels'!D35)","v":0},"-",{"$f":"IF('Séries individuels'!F35=\"\",\"\",'Séries individuels'!F35)","v":0},{"$f":"$E28","v":"Luis Domingo L. Gutiérrez (ESP)"},null,{"$f":"A291","v":"Erich Hinkelmann (AUT)"},{"$f":"IF(B291=\"\",0,1)+IF(B293=\"\",0,1)+IF(D295=\"\",0,1)","v":3},{"$f":"IF(B291>D291,1,0)+IF(B293>D293,1,0)+IF(D295>B295,1,0)","v":3},{"$f":"IF(B291<D291,1,0)+IF(B293<D293,1,0)+IF(D295<B295,1,0)","v":0},{"$f":"IF(B291=\"\",0,IF(B291=D291,1,0))+IF(B293=\"\",0,IF(B293=D293,1,0))+IF(B295=\"\",0,IF(B295=D295,1,0))","v":0},{"$f":"IF(B291=\"\",0,+B291)+IF(B293=\"\",0,+B293)+IF(D295=\"\",0,+D295)","v":9},{"$f":"IF(D291=\"\",0,+D291)+IF(D293=\"\",0,+D293)+IF(B295=\"\",0,+B295)","v":3},{"$f":"L292-M292","v":6},{"$f":"I292*3+K292","v":9},null,"Erich Hinkelmann (AUT)",3,3,0,0,9,3,6,9]
[{"$f":"$B28","v":"Erich Hinkelmann (AUT)"},{"$f":"IF('Séries individuels'!D168=\"\",\"\",'Séries individuels'!D168)","v":2},"-",{"$f":"IF('Séries individuels'!F168=\"\",\"\",'Séries individuels'!F168)","v":1},{"$f":"$D28","v":"Benoît Massart (BEL)"},null,{"$f":"E291","v":"Davide Lazzari (CZE)"},{"$f":"IF(D291=\"\",0,1)+IF(B294=\"\",0,1)+IF(B296=\"\",0,1)","v":3},{"$f":"IF(D291>B291,1,0)+IF(B294>D294,1,0)+IF(B296>D296,1,0)","v":0},{"$f":"IF(D291<B291,1,0)+IF(B294<D294,1,0)+IF(B296<D296,1,0)","v":2},{"$f":"IF(B291=\"\",0,IF(B291=D291,1,0))+IF(B294=\"\",0,IF(B294=D294,1,0))+IF(B296=\"\",0,IF(B296=D296,1,0))","v":1},{"$f":"IF(D291=\"\",0,+D291)+IF(B294=\"\",0,+B294)+IF(B296=\"\",0,+B296)","v":4},{"$f":"IF(B291=\"\",0,+B291)+IF(D294=\"\",0,+D294)+IF(D296=\"\",0,+D296)","v":8},{"$f":"L293-M293","v":-4},{"$f":"I293*3+K293","v":1},null,"Benoît Massart (BEL)",3,1,1,1,3,3,0,4]
[{"$f":"$C28","v":"Davide Lazzari (CZE)"},{"$f":"IF('Séries individuels'!D169=\"\",\"\",'Séries individuels'!D169)","v":2},"-",{"$f":"IF('Séries individuels'!F169=\"\",\"\",'Séries individuels'!F169)","v":2},{"$f":"$E28","v":"Luis Domingo L. Gutiérrez (ESP)"},null,{"$f":"A292","v":"Benoît Massart (BEL)"},{"$f":"IF(B292=\"\",0,1)+IF(D293=\"\",0,1)+IF(D296=\"\",0,1)","v":3},{"$f":"IF(B292>D292,1,0)+IF(D293>B293,1,0)+IF(D296>B296,1,0)","v":1},{"$f":"IF(B292<D292,1,0)+IF(D293<B293,1,0)+IF(D296<B296,1,0)","v":1},{"$f":"IF(B292=\"\",0,IF(B292=D292,1,0))+IF(B293=\"\",0,IF(B293=D293,1,0))+IF(B296=\"\",0,IF(B296=D296,1,0))","v":1},{"$f":"IF(B292=\"\",0,+B292)+IF(D293=\"\",0,+D293)+IF(D296=\"\",0,+D296)","v":3},{"$f":"IF(D292=\"\",0,+D292)+IF(B293=\"\",0,+B293)+IF(B296=\"\",0,+B296)","v":3},{"$f":"L294-M294","v":0},{"$f":"I294*3+K294","v":4},null,"Luis Domingo L. Gutiérrez (ESP)",3,0,1,2,3,5,-2,2]
[{"$f":"$E28","v":"Luis Domingo L. Gutiérrez (ESP)"},{"$f":"IF('Séries individuels'!D302=\"\",\"\",'Séries individuels'!D302)","v":1},"-",{"$f":"IF('Séries individuels'!F302=\"\",\"\",'Séries individuels'!F302)","v":3},{"$f":"$B28","v":"Erich Hinkelmann (AUT)"},null,{"$f":"E292","v":"Luis Domingo L. Gutiérrez (ESP)"},{"$f":"IF(D292=\"\",0,1)+IF(D294=\"\",0,1)+IF(B295=\"\",0,1)","v":3},{"$f":"IF(D292>B292,1,0)+IF(D294>B294,1,0)+IF(B295>D295,1,0)","v":0},{"$f":"IF(D292<B292,1,0)+IF(D294<B294,1,0)+IF(B295<D295,1,0)","v":1},{"$f":"IF(B292=\"\",0,IF(B292=D292,1,0))+IF(B294=\"\",0,IF(B294=D294,1,0))+IF(B295=\"\",0,IF(B295=D295,1,0))","v":2},{"$f":"IF(D292=\"\",0,+D292)+IF(D294=\"\",0,+D294)+IF(B295=\"\",0,+B295)","v":3},{"$f":"IF(B292=\"\",0,+B292)+IF(B294=\"\",0,+B294)+IF(D295=\"\",0,+D295)","v":5},{"$f":"L295-M295","v":-2},{"$f":"I295*3+K295","v":2},null,"Davide Lazzari (CZE)",3,0,2,1,4,8,-4,1]
[{"$f":"$C28","v":"Davide Lazzari (CZE)"},{"$f":"IF('Séries individuels'!D303=\"\",\"\",'Séries individuels'!D303)","v":1},"-",{"$f":"IF('Séries individuels'!F303=\"\",\"\",'Séries individuels'!F303)","v":2},{"$f":"$D28","v":"Benoît Massart (BEL)"},null,null,null,{"$f":"SUM(I292:I295)","v":4},{"$f":"SUM(J292:J295)","v":4},{"$f":"SUM(K292:K295)","v":4},{"$f":"SUM(L292:L295)","v":19},{"$f":"SUM(M292:M295)","v":19},{"$f":"SUM(N292:N295)","v":0}]
[]
["Group 8"]
[]
[{"$f":"$B29","v":"Chris Aggelinas (GRE)"},{"$f":"IF('Séries individuels'!D36=\"\",\"\",'Séries individuels'!D36)","v":1},"-",{"$f":"IF('Séries individuels'!F36=\"\",\"\",'Séries individuels'!F36)","v":1},{"$f":"$C29","v":"Éric Naszalyi (FRA)"},null,null,"P","W","L","N","+","-","d","PTS",null,null,"P","W","L","N","+","-","d","PTS"]
[{"$f":"$D29","v":"Hideaki Wada (JPN)"},{"$f":"IF('Séries individuels'!D37=\"\",\"\",'Séries individuels'!D37)","v":0},"-",{"$f":"IF('Séries individuels'!F37=\"\",\"\",'Séries individuels'!F37)","v":6},{"$f":"$E29","v":"Rob Conway (SCO)"},null,{"$f":"A300","v":"Chris Aggelinas (GRE)"},{"$f":"IF(B300=\"\",0,1)+IF(B302=\"\",0,1)+IF(D304=\"\",0,1)","v":3},{"$f":"IF(B300>D300,1,0)+IF(B302>D302,1,0)+IF(D304>B304,1,0)","v":2},{"$f":"IF(B300<D300,1,0)+IF(B302<D302,1,0)+IF(D304<B304,1,0)","v":0},{"$f":"IF(B300=\"\",0,IF(B300=D300,1,0))+IF(B302=\"\",0,IF(B302=D302,1,0))+IF(B304=\"\",0,IF(B304=D304,1,0))","v":1},{"$f":"IF(B300=\"\",0,+B300)+IF(B302=\"\",0,+B302)+IF(D304=\"\",0,+D304)","v":18},{"$f":"IF(D300=\"\",0,+D300)+IF(D302=\"\",0,+D302)+IF(B304=\"\",0,+B304)","v":1},{"$f":"L301-M301","v":17},{"$f":"I301*3+K301","v":7},null,"Chris Aggelinas (GRE)",3,2,0,1,18,1,17,7]
[{"$f":"$B29","v":"Chris Aggelinas (GRE)"},{"$f":"IF('Séries individuels'!D170=\"\",\"\",'Séries individuels'!D170)","v":11},"-",{"$f":"IF('Séries individuels'!F170=\"\",\"\",'Séries individuels'!F170)","v":0},{"$f":"$D29","v":"Hideaki Wada (JPN)"},null,{"$f":"E300","v":"Éric Naszalyi (FRA)"},{"$f":"IF(D300=\"\",0,1)+IF(B303=\"\",0,1)+IF(B305=\"\",0,1)","v":3},{"$f":"IF(D300>B300,1,0)+IF(B303>D303,1,0)+IF(B305>D305,1,0)","v":2},{"$f":"IF(D300<B300,1,0)+IF(B303<D303,1,0)+IF(B305<D305,1,0)","v":0},{"$f":"IF(B300=\"\",0,IF(B300=D300,1,0))+IF(B303=\"\",0,IF(B303=D303,1,0))+IF(B305=\"\",0,IF(B305=D305,1,0))","v":1},{"$f":"IF(D300=\"\",0,+D300)+IF(B303=\"\",0,+B303)+IF(B305=\"\",0,+B305)","v":14},{"$f":"IF(B300=\"\",0,+B300)+IF(D303=\"\",0,+D303)+IF(D305=\"\",0,+D305)","v":3},{"$f":"L302-M302","v":11},{"$f":"I302*3+K302","v":7},null,"Éric Naszalyi (FRA)",3,2,0,1,14,3,11,7]
[{"$f":"$C29","v":"Éric Naszalyi (FRA)"},{"$f":"IF('Séries individuels'!D171=\"\",\"\",'Séries individuels'!D171)","v":4},"-",{"$f":"IF('Séries individuels'!F171=\"\",\"\",'Séries individuels'!F171)","v":1},{"$f":"$E29","v":"Rob Conway (SCO)"},null,{"$f":"A301","v":"Hideaki Wada (JPN)"},{"$f":"IF(B301=\"\",0,1)+IF(D302=\"\",0,1)+IF(D305=\"\",0,1)","v":3},{"$f":"IF(B301>D301,1,0)+IF(D302>B302,1,0)+IF(D305>B305,1,0)","v":0},{"$f":"IF(B301<D301,1,0)+IF(D302<B302,1,0)+IF(D305<B305,1,0)","v":3},{"$f":"IF(B301=\"\",0,IF(B301=D301,1,0))+IF(B302=\"\",0,IF(B302=D302,1,0))+IF(B305=\"\",0,IF(B305=D305,1,0))","v":0},{"$f":"IF(B301=\"\",0,+B301)+IF(D302=\"\",0,+D302)+IF(D305=\"\",0,+D305)","v":1},{"$f":"IF(D301=\"\",0,+D301)+IF(B302=\"\",0,+B302)+IF(B305=\"\",0,+B305)","v":26},{"$f":"L303-M303","v":-25},{"$f":"I303*3+K303","v":0},null,"Rob Conway (SCO)",3,1,2,0,7,10,-3,3]
[{"$f":"$E29","v":"Rob Conway (SCO)"},{"$f":"IF('Séries individuels'!D304=\"\",\"\",'Séries individuels'!D304)","v":0},"-",{"$f":"IF('Séries individuels'!F304=\"\",\"\",'Séries individuels'!F304)","v":6},{"$f":"$B29","v":"Chris Aggelinas (GRE)"},null,{"$f":"E301","v":"Rob Conway (SCO)"},{"$f":"IF(D301=\"\",0,1)+IF(D303=\"\",0,1)+IF(B304=\"\",0,1)","v":3},{"$f":"IF(D301>B301,1,0)+IF(D303>B303,1,0)+IF(B304>D304,1,0)","v":1},{"$f":"IF(D301<B301,1,0)+IF(D303<B303,1,0)+IF(B304<D304,1,0)","v":2},{"$f":"IF(B301=\"\",0,IF(B301=D301,1,0))+IF(B303=\"\",0,IF(B303=D303,1,0))+IF(B304=\"\",0,IF(B304=D304,1,0))","v":0},{"$f":"IF(D301=\"\",0,+D301)+IF(D303=\"\",0,+D303)+IF(B304=\"\",0,+B304)","v":7},{"$f":"IF(B301=\"\",0,+B301)+IF(B303=\"\",0,+B303)+IF(D304=\"\",0,+D304)","v":10},{"$f":"L304-M304","v":-3},{"$f":"I304*3+K304","v":3},null,"Hideaki Wada (JPN)",3,0,3,0,1,26,-25,0]
[{"$f":"$C29","v":"Éric Naszalyi (FRA)"},{"$f":"IF('Séries individuels'!D305=\"\",\"\",'Séries individuels'!D305)","v":9},"-",{"$f":"IF('Séries individuels'!F305=\"\",\"\",'Séries individuels'!F305)","v":1},{"$f":"$D29","v":"Hideaki Wada (JPN)"},null,null,null,{"$f":"SUM(I301:I304)","v":5},{"$f":"SUM(J301:J304)","v":5},{"$f":"SUM(K301:K304)","v":2},{"$f":"SUM(L301:L304)","v":40},{"$f":"SUM(M301:M304)","v":40},{"$f":"SUM(N301:N304)","v":0}]
[]
["Group 9"]
[]
[{"$f":"$B30","v":"John Field (GIB)"},{"$f":"IF('Séries individuels'!D89=\"\",\"\",'Séries individuels'!D89)","v":1},"-",{"$f":"IF('Séries individuels'!F89=\"\",\"\",'Séries individuels'!F89)","v":1},{"$f":"$C30","v":"Giorgos Drazinakis (GRE)"},null,null,"P","W","L","N","+","-","d","PTS",null,null,"P","W","L","N","+","-","d","PTS"]
[{"$f":"$D30","v":"Patrick de Jong (NED)"},{"$f":"IF('Séries individuels'!D90=\"\",\"\",'Séries individuels'!D90)","v":2},"-",{"$f":"IF('Séries individuels'!F90=\"\",\"\",'Séries individuels'!F90)","v":1},{"$f":"$E30","v":"Massimiliano Croatti (ITA)"},null,{"$f":"A309","v":"John Field (GIB)"},{"$f":"IF(B309=\"\",0,1)+IF(B311=\"\",0,1)+IF(D313=\"\",0,1)","v":3},{"$f":"IF(B309>D309,1,0)+IF(B311>D311,1,0)+IF(D313>B313,1,0)","v":2},{"$f":"IF(B309<D309,1,0)+IF(B311<D311,1,0)+IF(D313<B313,1,0)","v":0},{"$f":"IF(B309=\"\",0,IF(B309=D309,1,0))+IF(B311=\"\",0,IF(B311=D311,1,0))+IF(B313=\"\",0,IF(B313=D313,1,0))","v":1},{"$f":"IF(B309=\"\",0,+B309)+IF(B311=\"\",0,+B311)+IF(D313=\"\",0,+D313)","v":9},{"$f":"IF(D309=\"\",0,+D309)+IF(D311=\"\",0,+D311)+IF(B313=\"\",0,+B313)","v":3},{"$f":"L310-M310","v":6},{"$f":"I310*3+K310","v":7},null,"John Field (GIB)",3,2,0,1,9,3,6,7]
[{"$f":"$B30","v":"John Field (GIB)"},{"$f":"IF('Séries individuels'!D223=\"\",\"\",'Séries individuels'!D223)","v":5},"-",{"$f":"IF('Séries individuels'!F223=\"\",\"\",'Séries individuels'!F223)","v":1},{"$f":"$D30","v":"Patrick de Jong (NED)"},null,{"$f":"E309","v":"Giorgos Drazinakis (GRE)"},{"$f":"IF(D309=\"\",0,1)+IF(B312=\"\",0,1)+IF(B314=\"\",0,1)","v":3},{"$f":"IF(D309>B309,1,0)+IF(B312>D312,1,0)+IF(B314>D314,1,0)","v":0},{"$f":"IF(D309<B309,1,0)+IF(B312<D312,1,0)+IF(B314<D314,1,0)","v":2},{"$f":"IF(B309=\"\",0,IF(B309=D309,1,0))+IF(B312=\"\",0,IF(B312=D312,1,0))+IF(B314=\"\",0,IF(B314=D314,1,0))","v":1},{"$f":"IF(D309=\"\",0,+D309)+IF(B312=\"\",0,+B312)+IF(B314=\"\",0,+B314)","v":2},{"$f":"IF(B309=\"\",0,+B309)+IF(D312=\"\",0,+D312)+IF(D314=\"\",0,+D314)","v":9},{"$f":"L311-M311","v":-7},{"$f":"I311*3+K311","v":1},null,"Patrick de Jong (NED)",3,2,1,0,6,6,0,6]
[{"$f":"$C30","v":"Giorgos Drazinakis (GRE)"},{"$f":"IF('Séries individuels'!D224=\"\",\"\",'Séries individuels'!D224)","v":1},"-",{"$f":"IF('Séries individuels'!F224=\"\",\"\",'Séries individuels'!F224)","v":5},{"$f":"$E30","v":"Massimiliano Croatti (ITA)"},null,{"$f":"A310","v":"Patrick de Jong (NED)"},{"$f":"IF(B310=\"\",0,1)+IF(D311=\"\",0,1)+IF(D314=\"\",0,1)","v":3},{"$f":"IF(B310>D310,1,0)+IF(D311>B311,1,0)+IF(D314>B314,1,0)","v":2},{"$f":"IF(B310<D310,1,0)+IF(D311<B311,1,0)+IF(D314<B314,1,0)","v":1},{"$f":"IF(B310=\"\",0,IF(B310=D310,1,0))+IF(B311=\"\",0,IF(B311=D311,1,0))+IF(B314=\"\",0,IF(B314=D314,1,0))","v":0},{"$f":"IF(B310=\"\",0,+B310)+IF(D311=\"\",0,+D311)+IF(D314=\"\",0,+D314)","v":6},{"$f":"IF(D310=\"\",0,+D310)+IF(B311=\"\",0,+B311)+IF(B314=\"\",0,+B314)","v":6},{"$f":"L312-M312","v":0},{"$f":"I312*3+K312","v":6},null,"Massimiliano Croatti (ITA)",3,1,2,0,7,6,1,3]
[{"$f":"$E30","v":"Massimiliano Croatti (ITA)"},{"$f":"IF('Séries individuels'!D357=\"\",\"\",'Séries individuels'!D357)","v":1},"-",{"$f":"IF('Séries individuels'!F357=\"\",\"\",'Séries individuels'!F357)","v":3},{"$f":"$B30","v":"John Field (GIB)"},null,{"$f":"E310","v":"Massimiliano Croatti (ITA)"},{"$f":"IF(D310=\"\",0,1)+IF(D312=\"\",0,1)+IF(B313=\"\",0,1)","v":3},{"$f":"IF(D310>B310,1,0)+IF(D312>B312,1,0)+IF(B313>D313,1,0)","v":1},{"$f":"IF(D310<B310,1,0)+IF(D312<B312,1,0)+IF(B313<D313,1,0)","v":2},{"$f":"IF(B310=\"\",0,IF(B310=D310,1,0))+IF(B312=\"\",0,IF(B312=D312,1,0))+IF(B313=\"\",0,IF(B313=D313,1,0))","v":0},{"$f":"IF(D310=\"\",0,+D310)+IF(D312=\"\",0,+D312)+IF(B313=\"\",0,+B313)","v":7},{"$f":"IF(B310=\"\",0,+B310)+IF(B312=\"\",0,+B312)+IF(D313=\"\",0,+D313)","v":6},{"$f":"L313-M313","v":1},{"$f":"I313*3+K313","v":3},null,"Giorgos Drazinakis (GRE)",3,0,2,1,2,9,-7,1]
[{"$f":"$C30","v":"Giorgos Drazinakis (GRE)"},{"$f":"IF('Séries individuels'!D358=\"\",\"\",'Séries individuels'!D358)","v":0},"-",{"$f":"IF('Séries individuels'!F358=\"\",\"\",'Séries individuels'!F358)","v":3},{"$f":"$D30","v":"Patrick de Jong (NED)"},null,null,null,{"$f":"SUM(I310:I313)","v":5},{"$f":"SUM(J310:J313)","v":5},{"$f":"SUM(K310:K313)","v":2},{"$f":"SUM(L310:L313)","v":24},{"$f":"SUM(M310:M313)","v":24},{"$f":"SUM(N310:N313)","v":0}]
[]
["Group 10"]
[]
[{"$f":"$B31","v":"Jason Pisani (MLT)"},{"$f":"IF('Séries individuels'!D91=\"\",\"\",'Séries individuels'!D91)","v":2},"-",{"$f":"IF('Séries individuels'!F91=\"\",\"\",'Séries individuels'!F91)","v":0},{"$f":"$C31","v":"Dimitris Stamatopoulos (GRE)"},null,null,"P","W","L","N","+","-","d","PTS",null,null,"P","W","L","N","+","-","d","PTS"]
[{"$f":"$D31","v":"Stéphane Pommier (FRA)"},{"$f":"IF('Séries individuels'!D92=\"\",\"\",'Séries individuels'!D92)","v":1},"-",{"$f":"IF('Séries individuels'!F92=\"\",\"\",'Séries individuels'!F92)","v":0},{"$f":"$E31","v":"Marco Zucchi (CZE)"},null,{"$f":"A318","v":"Jason Pisani (MLT)"},{"$f":"IF(B318=\"\",0,1)+IF(B320=\"\",0,1)+IF(D322=\"\",0,1)","v":3},{"$f":"IF(B318>D318,1,0)+IF(B320>D320,1,0)+IF(D322>B322,1,0)","v":3},{"$f":"IF(B318<D318,1,0)+IF(B320<D320,1,0)+IF(D322<B322,1,0)","v":0},{"$f":"IF(B318=\"\",0,IF(B318=D318,1,0))+IF(B320=\"\",0,IF(B320=D320,1,0))+IF(B322=\"\",0,IF(B322=D322,1,0))","v":0},{"$f":"IF(B318=\"\",0,+B318)+IF(B320=\"\",0,+B320)+IF(D322=\"\",0,+D322)","v":6},{"$f":"IF(D318=\"\",0,+D318)+IF(D320=\"\",0,+D320)+IF(B322=\"\",0,+B322)","v":2},{"$f":"L319-M319","v":4},{"$f":"I319*3+K319","v":9},null,"Jason Pisani (MLT)",3,3,0,0,6,2,4,9]
[{"$f":"$B31","v":"Jason Pisani (MLT)"},{"$f":"IF('Séries individuels'!D225=\"\",\"\",'Séries individuels'!D225)","v":2},"-",{"$f":"IF('Séries individuels'!F225=\"\",\"\",'Séries individuels'!F225)","v":1},{"$f":"$D31","v":"Stéphane Pommier (FRA)"},null,{"$f":"E318","v":"Dimitris Stamatopoulos (GRE)"},{"$f":"IF(D318=\"\",0,1)+IF(B321=\"\",0,1)+IF(B323=\"\",0,1)","v":3},{"$f":"IF(D318>B318,1,0)+IF(B321>D321,1,0)+IF(B323>D323,1,0)","v":2},{"$f":"IF(D318<B318,1,0)+IF(B321<D321,1,0)+IF(B323<D323,1,0)","v":1},{"$f":"IF(B318=\"\",0,IF(B318=D318,1,0))+IF(B321=\"\",0,IF(B321=D321,1,0))+IF(B323=\"\",0,IF(B323=D323,1,0))","v":0},{"$f":"IF(D318=\"\",0,+D318)+IF(B321=\"\",0,+B321)+IF(B323=\"\",0,+B323)","v":6},{"$f":"IF(B318=\"\",0,+B318)+IF(D321=\"\",0,+D321)+IF(D323=\"\",0,+D323)","v":4},{"$f":"L320-M320","v":2},{"$f":"I320*3+K320","v":6},null,"Dimitris Stamatopoulos (GRE)",3,2,1,0,6,4,2,6]
[{"$f":"$C31","v":"Dimitris Stamatopoulos (GRE)"},{"$f":"IF('Séries individuels'!D226=\"\",\"\",'Séries individuels'!D226)","v":3},"-",{"$f":"IF('Séries individuels'!F226=\"\",\"\",'Séries individuels'!F226)","v":1},{"$f":"$E31","v":"Marco Zucchi (CZE)"},null,{"$f":"A319","v":"Stéphane Pommier (FRA)"},{"$f":"IF(B319=\"\",0,1)+IF(D320=\"\",0,1)+IF(D323=\"\",0,1)","v":3},{"$f":"IF(B319>D319,1,0)+IF(D320>B320,1,0)+IF(D323>B323,1,0)","v":1},{"$f":"IF(B319<D319,1,0)+IF(D320<B320,1,0)+IF(D323<B323,1,0)","v":2},{"$f":"IF(B319=\"\",0,IF(B319=D319,1,0))+IF(B320=\"\",0,IF(B320=D320,1,0))+IF(B323=\"\",0,IF(B323=D323,1,0))","v":0},{"$f":"IF(B319=\"\",0,+B319)+IF(D320=\"\",0,+D320)+IF(D323=\"\",0,+D323)","v":3},{"$f":"IF(D319=\"\",0,+D319)+IF(B320=\"\",0,+B320)+IF(B323=\"\",0,+B323)","v":5},{"$f":"L321-M321","v":-2},{"$f":"I321*3+K321","v":3},null,"Stéphane Pommier (FRA)",3,1,2,0,3,5,-2,3]
[{"$f":"$E31","v":"Marco Zucchi (CZE)"},{"$f":"IF('Séries individuels'!D359=\"\",\"\",'Séries individuels'!D359)","v":1},"-",{"$f":"IF('Séries individuels'!F359=\"\",\"\",'Séries individuels'!F359)","v":2},{"$f":"$B31","v":"Jason Pisani (MLT)"},null,{"$f":"E319","v":"Marco Zucchi (CZE)"},{"$f":"IF(D319=\"\",0,1)+IF(D321=\"\",0,1)+IF(B322=\"\",0,1)","v":3},{"$f":"IF(D319>B319,1,0)+IF(D321>B321,1,0)+IF(B322>D322,1,0)","v":0},{"$f":"IF(D319<B319,1,0)+IF(D321<B321,1,0)+IF(B322<D322,1,0)","v":3},{"$f":"IF(B319=\"\",0,IF(B319=D319,1,0))+IF(B321=\"\",0,IF(B321=D321,1,0))+IF(B322=\"\",0,IF(B322=D322,1,0))","v":0},{"$f":"IF(D319=\"\",0,+D319)+IF(D321=\"\",0,+D321)+IF(B322=\"\",0,+B322)","v":2},{"$f":"IF(B319=\"\",0,+B319)+IF(B321=\"\",0,+B321)+IF(D322=\"\",0,+D322)","v":6},{"$f":"L322-M322","v":-4},{"$f":"I322*3+K322","v":0},null,"Marco Zucchi (CZE)",3,0,3,0,2,6,-4,0]
[{"$f":"$C31","v":"Dimitris Stamatopoulos (GRE)"},{"$f":"IF('Séries individuels'!D360=\"\",\"\",'Séries individuels'!D360)","v":3},"-",{"$f":"IF('Séries individuels'!F360=\"\",\"\",'Séries individuels'!F360)","v":1},{"$f":"$D31","v":"Stéphane Pommier (FRA)"},null,null,null,{"$f":"SUM(I319:I322)","v":6},{"$f":"SUM(J319:J322)","v":6},{"$f":"SUM(K319:K322)","v":0},{"$f":"SUM(L319:L322)","v":17},{"$f":"SUM(M319:M322)","v":17},{"$f":"SUM(N319:N322)","v":0}]
[]
["Group 11"]
[]
[{"$f":"$B32","v":"Charles Aquilina (MLT)"},{"$f":"IF('Séries individuels'!D93=\"\",\"\",'Séries individuels'!D93)","v":3},"-",{"$f":"IF('Séries individuels'!F93=\"\",\"\",'Séries individuels'!F93)","v":0},{"$f":"$C32","v":"Andy Beskaby (SCO)"},null,null,"P","W","L","N","+","-","d","PTS",null,null,"P","W","L","N","+","-","d","PTS"]
[{"$f":"$D32","v":"Brian Daley (ENG)"},{"$f":"IF('Séries individuels'!D94=\"\",\"\",'Séries individuels'!D94)","v":3},"-",{"$f":"IF('Séries individuels'!F94=\"\",\"\",'Séries individuels'!F94)","v":3},{"$f":"$E32","v":"Rainer Vogt (GER)"},null,{"$f":"A327","v":"Charles Aquilina (MLT)"},{"$f":"IF(B327=\"\",0,1)+IF(B329=\"\",0,1)+IF(D331=\"\",0,1)","v":3},{"$f":"IF(B327>D327,1,0)+IF(B329>D329,1,0)+IF(D331>B331,1,0)","v":3},{"$f":"IF(B327<D327,1,0)+IF(B329<D329,1,0)+IF(D331<B331,1,0)","v":0},{"$f":"IF(B327=\"\",0,IF(B327=D327,1,0))+IF(B329=\"\",0,IF(B329=D329,1,0))+IF(B331=\"\",0,IF(B331=D331,1,0))","v":0},{"$f":"IF(B327=\"\",0,+B327)+IF(B329=\"\",0,+B329)+IF(D331=\"\",0,+D331)","v":13},{"$f":"IF(D327=\"\",0,+D327)+IF(D329=\"\",0,+D329)+IF(B331=\"\",0,+B331)","v":1},{"$f":"L328-M328","v":12},{"$f":"I328*3+K328","v":9},null,"Charles Aquilina (MLT)",3,3,0,0,13,1,12,9]
[{"$f":"$B32","v":"Charles Aquilina (MLT)"},{"$f":"IF('Séries individuels'!D227=\"\",\"\",'Séries individuels'!D227)","v":5},"-",{"$f":"IF('Séries individuels'!F227=\"\",\"\",'Séries individuels'!F227)","v":0},{"$f":"$D32","v":"Brian Daley (ENG)"},null,{"$f":"E327","v":"Andy Beskaby (SCO)"},{"$f":"IF(D327=\"\",0,1)+IF(B330=\"\",0,1)+IF(B332=\"\",0,1)","v":3},{"$f":"IF(D327>B327,1,0)+IF(B330>D330,1,0)+IF(B332>D332,1,0)","v":1},{"$f":"IF(D327<B327,1,0)+IF(B330<D330,1,0)+IF(B332<D332,1,0)","v":2},{"$f":"IF(B327=\"\",0,IF(B327=D327,1,0))+IF(B330=\"\",0,IF(B330=D330,1,0))+IF(B332=\"\",0,IF(B332=D332,1,0))","v":0},{"$f":"IF(D327=\"\",0,+D327)+IF(B330=\"\",0,+B330)+IF(B332=\"\",0,+B332)","v":7},{"$f":"IF(B327=\"\",0,+B327)+IF(D330=\"\",0,+D330)+IF(D332=\"\",0,+D332)","v":11},{"$f":"L329-M329","v":-4},{"$f":"I329*3+K329","v":3},null,"Rainer Vogt (GER)",3,1,1,1,9,10,-1,4]
[{"$f":"$C32","v":"Andy Beskaby (SCO)"},{"$f":"IF('Séries individuels'!D228=\"\",\"\",'Séries individuels'!D228)","v":2},"-",{"$f":"IF('Séries individuels'!F228=\"\",\"\",'Séries individuels'!F228)","v":5},{"$f":"$E32","v":"Rainer Vogt (GER)"},null,{"$f":"A328","v":"Brian Daley (ENG)"},{"$f":"IF(B328=\"\",0,1)+IF(D329=\"\",0,1)+IF(D332=\"\",0,1)","v":3},{"$f":"IF(B328>D328,1,0)+IF(D329>B329,1,0)+IF(D332>B332,1,0)","v":0},{"$f":"IF(B328<D328,1,0)+IF(D329<B329,1,0)+IF(D332<B332,1,0)","v":2},{"$f":"IF(B328=\"\",0,IF(B328=D328,1,0))+IF(B329=\"\",0,IF(B329=D329,1,0))+IF(B332=\"\",0,IF(B332=D332,1,0))","v":1},{"$f":"IF(B328=\"\",0,+B328)+IF(D329=\"\",0,+D329)+IF(D332=\"\",0,+D332)","v":6},{"$f":"IF(D328=\"\",0,+D328)+IF(B329=\"\",0,+B329)+IF(B332=\"\",0,+B332)","v":13},{"$f":"L330-M330","v":-7},{"$f":"I330*3+K330","v":1},null,"Andy Beskaby (SCO)",3,1,2,0,7,11,-4,3]
[{"$f":"$E32","v":"Rainer Vogt (GER)"},{"$f":"IF('Séries individuels'!D361=\"\",\"\",'Séries individuels'!D361)","v":1},"-",{"$f":"IF('Séries individuels'!F361=\"\",\"\",'Séries individuels'!F361)","v":5},{"$f":"$B32","v":"Charles Aquilina (MLT)"},null,{"$f":"E328","v":"Rainer Vogt (GER)"},{"$f":"IF(D328=\"\",0,1)+IF(D330=\"\",0,1)+IF(B331=\"\",0,1)","v":3},{"$f":"IF(D328>B328,1,0)+IF(D330>B330,1,0)+IF(B331>D331,1,0)","v":1},{"$f":"IF(D328<B328,1,0)+IF(D330<B330,1,0)+IF(B331<D331,1,0)","v":1},{"$f":"IF(B328=\"\",0,IF(B328=D328,1,0))+IF(B330=\"\",0,IF(B330=D330,1,0))+IF(B331=\"\",0,IF(B331=D331,1,0))","v":1},{"$f":"IF(D328=\"\",0,+D328)+IF(D330=\"\",0,+D330)+IF(B331=\"\",0,+B331)","v":9},{"$f":"IF(B328=\"\",0,+B328)+IF(B330=\"\",0,+B330)+IF(D331=\"\",0,+D331)","v":10},{"$f":"L331-M331","v":-1},{"$f":"I331*3+K331","v":4},null,"Brian Daley (ENG)",3,0,2,1,6,13,-7,1]
[{"$f":"$C32","v":"Andy Beskaby (SCO)"},{"$f":"IF('Séries individuels'!D362=\"\",\"\",'Séries individuels'!D362)","v":5},"-",{"$f":"IF('Séries individuels'!F362=\"\",\"\",'Séries individuels'!F362)","v":3},{"$f":"$D32","v":"Brian Daley (ENG)"},null,null,null,{"$f":"SUM(I328:I331)","v":5},{"$f":"SUM(J328:J331)","v":5},{"$f":"SUM(K328:K331)","v":2},{"$f":"SUM(L328:L331)","v":35},{"$f":"SUM(M328:M331)","v":35},{"$f":"SUM(N328:N331)","v":0}]
[]
["Group 12"]
[]
[{"$f":"$B33","v":"Eric Threis (BEL)"},{"$f":"IF('Séries individuels'!D95=\"\",\"\",'Séries individuels'!D95)","v":7},"-",{"$f":"IF('Séries individuels'!F95=\"\",\"\",'Séries individuels'!F95)","v":1},{"$f":"$C33","v":"Tom Horn (GER)"},null,null,"P","W","L","N","+","-","d","PTS",null,null,"P","W","L","N","+","-","d","PTS"]
[{"$f":"$D33","v":"Giorgos Aggelinas (GRE)"},{"$f":"IF('Séries individuels'!D96=\"\",\"\",'Séries individuels'!D96)","v":0},"-",{"$f":"IF('Séries individuels'!F96=\"\",\"\",'Séries individuels'!F96)","v":0},{"$f":"$E33","v":"John Zammit (MLT)"},null,{"$f":"A336","v":"Eric Threis (BEL)"},{"$f":"IF(B336=\"\",0,1)+IF(B338=\"\",0,1)+IF(D340=\"\",0,1)","v":3},{"$f":"IF(B336>D336,1,0)+IF(B338>D338,1,0)+IF(D340>B340,1,0)","v":3},{"$f":"IF(B336<D336,1,0)+IF(B338<D338,1,0)+IF(D340<B340,1,0)","v":0},{"$f":"IF(B336=\"\",0,IF(B336=D336,1,0))+IF(B338=\"\",0,IF(B338=D338,1,0))+IF(B340=\"\",0,IF(B340=D340,1,0))","v":0},{"$f":"IF(B336=\"\",0,+B336)+IF(B338=\"\",0,+B338)+IF(D340=\"\",0,+D340)","v":14},{"$f":"IF(D336=\"\",0,+D336)+IF(D338=\"\",0,+D338)+IF(B340=\"\",0,+B340)","v":2},{"$f":"L337-M337","v":12},{"$f":"I337*3+K337","v":9},null,"Eric Threis (BEL)",3,3,0,0,14,2,12,9]
[{"$f":"$B33","v":"Eric Threis (BEL)"},{"$f":"IF('Séries individuels'!D229=\"\",\"\",'Séries individuels'!D229)","v":6},"-",{"$f":"IF('Séries individuels'!F229=\"\",\"\",'Séries individuels'!F229)","v":1},{"$f":"$D33","v":"Giorgos Aggelinas (GRE)"},null,{"$f":"E336","v":"Tom Horn (GER)"},{"$f":"IF(D336=\"\",0,1)+IF(B339=\"\",0,1)+IF(B341=\"\",0,1)","v":3},{"$f":"IF(D336>B336,1,0)+IF(B339>D339,1,0)+IF(B341>D341,1,0)","v":0},{"$f":"IF(D336<B336,1,0)+IF(B339<D339,1,0)+IF(B341<D341,1,0)","v":3},{"$f":"IF(B336=\"\",0,IF(B336=D336,1,0))+IF(B339=\"\",0,IF(B339=D339,1,0))+IF(B341=\"\",0,IF(B341=D341,1,0))","v":0},{"$f":"IF(D336=\"\",0,+D336)+IF(B339=\"\",0,+B339)+IF(B341=\"\",0,+B341)","v":4},{"$f":"IF(B336=\"\",0,+B336)+IF(D339=\"\",0,+D339)+IF(D341=\"\",0,+D341)","v":16},{"$f":"L338-M338","v":-12},{"$f":"I338*3+K338","v":0},null,"John Zammit (MLT)",3,1,1,1,5,3,2,4]
[{"$f":"$C33","v":"Tom Horn (GER)"},{"$f":"IF('Séries individuels'!D230=\"\",\"\",'Séries individuels'!D230)","v":2},"-",{"$f":"IF('Séries individuels'!F230=\"\",\"\",'Séries individuels'!F230)","v":5},{"$f":"$E33","v":"John Zammit (MLT)"},null,{"$f":"A337","v":"Giorgos Aggelinas (GRE)"},{"$f":"IF(B337=\"\",0,1)+IF(D338=\"\",0,1)+IF(D341=\"\",0,1)","v":3},{"$f":"IF(B337>D337,1,0)+IF(D338>B338,1,0)+IF(D341>B341,1,0)","v":1},{"$f":"IF(B337<D337,1,0)+IF(D338<B338,1,0)+IF(D341<B341,1,0)","v":1},{"$f":"IF(B337=\"\",0,IF(B337=D337,1,0))+IF(B338=\"\",0,IF(B338=D338,1,0))+IF(B341=\"\",0,IF(B341=D341,1,0))","v":1},{"$f":"IF(B337=\"\",0,+B337)+IF(D338=\"\",0,+D338)+IF(D341=\"\",0,+D341)","v":5},{"$f":"IF(D337=\"\",0,+D337)+IF(B338=\"\",0,+B338)+IF(B341=\"\",0,+B341)","v":7},{"$f":"L339-M339","v":-2},{"$f":"I339*3+K339","v":4},null,"Giorgos Aggelinas (GRE)",3,1,1,1,5,7,-2,4]
[{"$f":"$E33","v":"John Zammit (MLT)"},{"$f":"IF('Séries individuels'!D363=\"\",\"\",'Séries individuels'!D363)","v":0},"-",{"$f":"IF('Séries individuels'!F363=\"\",\"\",'Séries individuels'!F363)","v":1},{"$f":"$B33","v":"Eric Threis (BEL)"},null,{"$f":"E337","v":"John Zammit (MLT)"},{"$f":"IF(D337=\"\",0,1)+IF(D339=\"\",0,1)+IF(B340=\"\",0,1)","v":3},{"$f":"IF(D337>B337,1,0)+IF(D339>B339,1,0)+IF(B340>D340,1,0)","v":1},{"$f":"IF(D337<B337,1,0)+IF(D339<B339,1,0)+IF(B340<D340,1,0)","v":1},{"$f":"IF(B337=\"\",0,IF(B337=D337,1,0))+IF(B339=\"\",0,IF(B339=D339,1,0))+IF(B340=\"\",0,IF(B340=D340,1,0))","v":1},{"$f":"IF(D337=\"\",0,+D337)+IF(D339=\"\",0,+D339)+IF(B340=\"\",0,+B340)","v":5},{"$f":"IF(B337=\"\",0,+B337)+IF(B339=\"\",0,+B339)+IF(D340=\"\",0,+D340)","v":3},{"$f":"L340-M340","v":2},{"$f":"I340*3+K340","v":4},null,"Tom Horn (GER)",3,0,3,0,4,16,-12,0]
[{"$f":"$C33","v":"Tom Horn (GER)"},{"$f":"IF('Séries individuels'!D364=\"\",\"\",'Séries individuels'!D364)","v":1},"-",{"$f":"IF('Séries individuels'!F364=\"\",\"\",'Séries individuels'!F364)","v":4},{"$f":"$D33","v":"Giorgos Aggelinas (GRE)"},null,null,null,{"$f":"SUM(I337:I340)","v":5},{"$f":"SUM(J337:J340)","v":5},{"$f":"SUM(K337:K340)","v":2},{"$f":"SUM(L337:L340)","v":28},{"$f":"SUM(M337:M340)","v":28},{"$f":"SUM(N337:N340)","v":0}]
[]
["Group 13"]
[]
[{"$f":"$B34","v":"Alain Jadot (BEL)"},{"$f":"IF('Séries individuels'!D97=\"\",\"\",'Séries individuels'!D97)","v":2},"-",{"$f":"IF('Séries individuels'!F97=\"\",\"\",'Séries individuels'!F97)","v":0},{"$f":"$C34","v":"Ferrán Coll (ESP)"},null,null,"P","W","L","N","+","-","d","PTS",null,null,"P","W","L","N","+","-","d","PTS"]
[{"$f":"$D34","v":"Robert Green (AUS)"},{"$f":"IF('Séries individuels'!D98=\"\",\"\",'Séries individuels'!D98)","v":0},"-",{"$f":"IF('Séries individuels'!F98=\"\",\"\",'Séries individuels'!F98)","v":1},{"$f":"$E34","v":"Jose Luis Bonavia (GIB)"},null,{"$f":"A345","v":"Alain Jadot (BEL)"},{"$f":"IF(B345=\"\",0,1)+IF(B347=\"\",0,1)+IF(D349=\"\",0,1)","v":3},{"$f":"IF(B345>D345,1,0)+IF(B347>D347,1,0)+IF(D349>B349,1,0)","v":3},{"$f":"IF(B345<D345,1,0)+IF(B347<D347,1,0)+IF(D349<B349,1,0)","v":0},{"$f":"IF(B345=\"\",0,IF(B345=D345,1,0))+IF(B347=\"\",0,IF(B347=D347,1,0))+IF(B349=\"\",0,IF(B349=D349,1,0))","v":0},{"$f":"IF(B345=\"\",0,+B345)+IF(B347=\"\",0,+B347)+IF(D349=\"\",0,+D349)","v":7},{"$f":"IF(D345=\"\",0,+D345)+IF(D347=\"\",0,+D347)+IF(B349=\"\",0,+B349)","v":1},{"$f":"L346-M346","v":6},{"$f":"I346*3+K346","v":9},null,"Alain Jadot (BEL)",3,3,0,0,7,1,6,9]
[{"$f":"$B34","v":"Alain Jadot (BEL)"},{"$f":"IF('Séries individuels'!D231=\"\",\"\",'Séries individuels'!D231)","v":3},"-",{"$f":"IF('Séries individuels'!F231=\"\",\"\",'Séries individuels'!F231)","v":1},{"$f":"$D34","v":"Robert Green (AUS)"},null,{"$f":"E345","v":"Ferrán Coll (ESP)"},{"$f":"IF(D345=\"\",0,1)+IF(B348=\"\",0,1)+IF(B350=\"\",0,1)","v":3},{"$f":"IF(D345>B345,1,0)+IF(B348>D348,1,0)+IF(B350>D350,1,0)","v":2},{"$f":"IF(D345<B345,1,0)+IF(B348<D348,1,0)+IF(B350<D350,1,0)","v":1},{"$f":"IF(B345=\"\",0,IF(B345=D345,1,0))+IF(B348=\"\",0,IF(B348=D348,1,0))+IF(B350=\"\",0,IF(B350=D350,1,0))","v":0},{"$f":"IF(D345=\"\",0,+D345)+IF(B348=\"\",0,+B348)+IF(B350=\"\",0,+B350)","v":8},{"$f":"IF(B345=\"\",0,+B345)+IF(D348=\"\",0,+D348)+IF(D350=\"\",0,+D350)","v":5},{"$f":"L347-M347","v":3},{"$f":"I347*3+K347","v":6},null,"Ferrán Coll (ESP)",3,2,1,0,8,5,3,6]
[{"$f":"$C34","v":"Ferrán Coll (ESP)"},{"$f":"IF('Séries individuels'!D232=\"\",\"\",'Séries individuels'!D232)","v":5},"-",{"$f":"IF('Séries individuels'!F232=\"\",\"\",'Séries individuels'!F232)","v":2},{"$f":"$E34","v":"Jose Luis Bonavia (GIB)"},null,{"$f":"A346","v":"Robert Green (AUS)"},{"$f":"IF(B346=\"\",0,1)+IF(D347=\"\",0,1)+IF(D350=\"\",0,1)","v":3},{"$f":"IF(B346>D346,1,0)+IF(D347>B347,1,0)+IF(D350>B350,1,0)","v":0},{"$f":"IF(B346<D346,1,0)+IF(D347<B347,1,0)+IF(D350<B350,1,0)","v":3},{"$f":"IF(B346=\"\",0,IF(B346=D346,1,0))+IF(B347=\"\",0,IF(B347=D347,1,0))+IF(B350=\"\",0,IF(B350=D350,1,0))","v":0},{"$f":"IF(B346=\"\",0,+B346)+IF(D347=\"\",0,+D347)+IF(D350=\"\",0,+D350)","v":2},{"$f":"IF(D346=\"\",0,+D346)+IF(B347=\"\",0,+B347)+IF(B350=\"\",0,+B350)","v":7},{"$f":"L348-M348","v":-5},{"$f":"I348*3+K348","v":0},null,"Jose Luis Bonavia (GIB)",3,1,2,0,3,7,-4,3]
[{"$f":"$E34","v":"Jose Luis Bonavia (GIB)"},{"$f":"IF('Séries individuels'!D365=\"\",\"\",'Séries individuels'!D365)","v":0},"-",{"$f":"IF('Séries individuels'!F365=\"\",\"\",'Séries individuels'!F365)","v":2},{"$f":"$B34","v":"Alain Jadot (BEL)"},null,{"$f":"E346","v":"Jose Luis Bonavia (GIB)"},{"$f":"IF(D346=\"\",0,1)+IF(D348=\"\",0,1)+IF(B349=\"\",0,1)","v":3},{"$f":"IF(D346>B346,1,0)+IF(D348>B348,1,0)+IF(B349>D349,1,0)","v":1},{"$f":"IF(D346<B346,1,0)+IF(D348<B348,1,0)+IF(B349<D349,1,0)","v":2},{"$f":"IF(B346=\"\",0,IF(B346=D346,1,0))+IF(B348=\"\",0,IF(B348=D348,1,0))+IF(B349=\"\",0,IF(B349=D349,1,0))","v":0},{"$f":"IF(D346=\"\",0,+D346)+IF(D348=\"\",0,+D348)+IF(B349=\"\",0,+B349)","v":3},{"$f":"IF(B346=\"\",0,+B346)+IF(B348=\"\",0,+B348)+IF(D349=\"\",0,+D349)","v":7},{"$f":"L349-M349","v":-4},{"$f":"I349*3+K349","v":3},null,"Robert Green (AUS)",3,0,3,0,2,7,-5,0]
[{"$f":"$C34","v":"Ferrán Coll (ESP)"},{"$f":"IF('Séries individuels'!D366=\"\",\"\",'Séries individuels'!D366)","v":3},"-",{"$f":"IF('Séries individuels'!F366=\"\",\"\",'Séries individuels'!F366)","v":1},{"$f":"$D34","v":"Robert Green (AUS)"},null,null,null,{"$f":"SUM(I346:I349)","v":6},{"$f":"SUM(J346:J349)","v":6},{"$f":"SUM(K346:K349)","v":0},{"$f":"SUM(L346:L349)","v":20},{"$f":"SUM(M346:M349)","v":20},{"$f":"SUM(N346:N349)","v":0}]
[]
["Group 14"]
[]
[{"$f":"$B35","v":"Manfred Pawlica (AUT)"},{"$f":"IF('Séries individuels'!D99=\"\",\"\",'Séries individuels'!D99)","v":0},"-",{"$f":"IF('Séries individuels'!F99=\"\",\"\",'Séries individuels'!F99)","v":1},{"$f":"$C35","v":"Stefano De Francesco (ITA)"},null,null,"P","W","L","N","+","-","d","PTS",null,null,"P","W","L","N","+","-","d","PTS"]
[{"$f":"$D35","v":"Thierry Vivron (FRA)"},{"$f":"IF('Séries individuels'!D100=\"\",\"\",'Séries individuels'!D100)","v":0},"-",{"$f":"IF('Séries individuels'!F100=\"\",\"\",'Séries individuels'!F100)","v":7},{"$f":"$E35","v":"Arnold Mair (GER)"},null,{"$f":"A354","v":"Manfred Pawlica (AUT)"},{"$f":"IF(B354=\"\",0,1)+IF(B356=\"\",0,1)+IF(D358=\"\",0,1)","v":3},{"$f":"IF(B354>D354,1,0)+IF(B356>D356,1,0)+IF(D358>B358,1,0)","v":0},{"$f":"IF(B354<D354,1,0)+IF(B356<D356,1,0)+IF(D358<B358,1,0)","v":1},{"$f":"IF(B354=\"\",0,IF(B354=D354,1,0))+IF(B356=\"\",0,IF(B356=D356,1,0))+IF(B358=\"\",0,IF(B358=D358,1,0))","v":2},{"$f":"IF(B354=\"\",0,+B354)+IF(B356=\"\",0,+B356)+IF(D358=\"\",0,+D358)","v":2},{"$f":"IF(D354=\"\",0,+D354)+IF(D356=\"\",0,+D356)+IF(B358=\"\",0,+B358)","v":3},{"$f":"L355-M355","v":-1},{"$f":"I355*3+K355","v":2},null,"Stefano De Francesco (ITA)",3,2,0,1,7,4,3,7]
[{"$f":"$B35","v":"Manfred Pawlica (AUT)"},{"$f":"IF('Séries individuels'!D233=\"\",\"\",'Séries individuels'!D233)","v":2},"-",{"$f":"IF('Séries individuels'!F233=\"\",\"\",'Séries individuels'!F233)","v":2},{"$f":"$D35","v":"Thierry Vivron (FRA)"},null,{"$f":"E354","v":"Stefano De Francesco (ITA)"},{"$f":"IF(D354=\"\",0,1)+IF(B357=\"\",0,1)+IF(B359=\"\",0,1)","v":3},{"$f":"IF(D354>B354,1,0)+IF(B357>D357,1,0)+IF(B359>D359,1,0)","v":2},{"$f":"IF(D354<B354,1,0)+IF(B357<D357,1,0)+IF(B359<D359,1,0)","v":0},{"$f":"IF(B354=\"\",0,IF(B354=D354,1,0))+IF(B357=\"\",0,IF(B357=D357,1,0))+IF(B359=\"\",0,IF(B359=D359,1,0))","v":1},{"$f":"IF(D354=\"\",0,+D354)+IF(B357=\"\",0,+B357)+IF(B359=\"\",0,+B359)","v":7},{"$f":"IF(B354=\"\",0,+B354)+IF(D357=\"\",0,+D357)+IF(D359=\"\",0,+D359)","v":4},{"$f":"L356-M356","v":3},{"$f":"I356*3+K356","v":7},null,"Arnold Mair (GER)",3,1,1,1,8,3,5,4]
[{"$f":"$C35","v":"Stefano De Francesco (ITA)"},{"$f":"IF('Séries individuels'!D234=\"\",\"\",'Séries individuels'!D234)","v":3},"-",{"$f":"IF('Séries individuels'!F234=\"\",\"\",'Séries individuels'!F234)","v":1},{"$f":"$E35","v":"Arnold Mair (GER)"},null,{"$f":"A355","v":"Thierry Vivron (FRA)"},{"$f":"IF(B355=\"\",0,1)+IF(D356=\"\",0,1)+IF(D359=\"\",0,1)","v":3},{"$f":"IF(B355>D355,1,0)+IF(D356>B356,1,0)+IF(D359>B359,1,0)","v":0},{"$f":"IF(B355<D355,1,0)+IF(D356<B356,1,0)+IF(D359<B359,1,0)","v":1},{"$f":"IF(B355=\"\",0,IF(B355=D355,1,0))+IF(B356=\"\",0,IF(B356=D356,1,0))+IF(B359=\"\",0,IF(B359=D359,1,0))","v":2},{"$f":"IF(B355=\"\",0,+B355)+IF(D356=\"\",0,+D356)+IF(D359=\"\",0,+D359)","v":5},{"$f":"IF(D355=\"\",0,+D355)+IF(B356=\"\",0,+B356)+IF(B359=\"\",0,+B359)","v":12},{"$f":"L357-M357","v":-7},{"$f":"I357*3+K357","v":2},null,"Manfred Pawlica (AUT)",3,0,1,2,2,3,-1,2]
[{"$f":"$E35","v":"Arnold Mair (GER)"},{"$f":"IF('Séries individuels'!D367=\"\",\"\",'Séries individuels'!D367)","v":0},"-",{"$f":"IF('Séries individuels'!F367=\"\",\"\",'Séries individuels'!F367)","v":0},{"$f":"$B35","v":"Manfred Pawlica (AUT)"},null,{"$f":"E355","v":"Arnold Mair (GER)"},{"$f":"IF(D355=\"\",0,1)+IF(D357=\"\",0,1)+IF(B358=\"\",0,1)","v":3},{"$f":"IF(D355>B355,1,0)+IF(D357>B357,1,0)+IF(B358>D358,1,0)","v":1},{"$f":"IF(D355<B355,1,0)+IF(D357<B357,1,0)+IF(B358<D358,1,0)","v":1},{"$f":"IF(B355=\"\",0,IF(B355=D355,1,0))+IF(B357=\"\",0,IF(B357=D357,1,0))+IF(B358=\"\",0,IF(B358=D358,1,0))","v":1},{"$f":"IF(D355=\"\",0,+D355)+IF(D357=\"\",0,+D357)+IF(B358=\"\",0,+B358)","v":8},{"$f":"IF(B355=\"\",0,+B355)+IF(B357=\"\",0,+B357)+IF(D358=\"\",0,+D358)","v":3},{"$f":"L358-M358","v":5},{"$f":"I358*3+K358","v":4},null,"Thierry Vivron (FRA)",3,0,1,2,5,12,-7,2]
[{"$f":"$C35","v":"Stefano De Francesco (ITA)"},{"$f":"IF('Séries individuels'!D368=\"\",\"\",'Séries individuels'!D368)","v":3},"-",{"$f":"IF('Séries individuels'!F368=\"\",\"\",'Séries individuels'!F368)","v":3},{"$f":"$D35","v":"Thierry Vivron (FRA)"},null,null,null,{"$f":"SUM(I355:I358)","v":3},{"$f":"SUM(J355:J358)","v":3},{"$f":"SUM(K355:K358)","v":6},{"$f":"SUM(L355:L358)","v":22},{"$f":"SUM(M355:M358)","v":22},{"$f":"SUM(N355:N358)","v":0}]
[]
["Group 15"]
[]
[{"$f":"$B36","v":"Patrizio Lazzaretti (ITA)"},{"$f":"IF('Séries individuels'!D101=\"\",\"\",'Séries individuels'!D101)","v":4},"-",{"$f":"IF('Séries individuels'!F101=\"\",\"\",'Séries individuels'!F101)","v":0},{"$f":"$C36","v":"Gregg Deinhart (USA)"},null,null,"P","W","L","N","+","-","d","PTS",null,null,"P","W","L","N","+","-","d","PTS"]
[{"$f":"$D36","v":"Justin Finch (ENG)"},{"$f":"IF('Séries individuels'!D102=\"\",\"\",'Séries individuels'!D102)","v":0},"-",{"$f":"IF('Séries individuels'!F102=\"\",\"\",'Séries individuels'!F102)","v":2},{"$f":"$E36","v":"Guy Palmer (GIB)"},null,{"$f":"A363","v":"Patrizio Lazzaretti (ITA)"},{"$f":"IF(B363=\"\",0,1)+IF(B365=\"\",0,1)+IF(D367=\"\",0,1)","v":3},{"$f":"IF(B363>D363,1,0)+IF(B365>D365,1,0)+IF(D367>B367,1,0)","v":3},{"$f":"IF(B363<D363,1,0)+IF(B365<D365,1,0)+IF(D367<B367,1,0)","v":0},{"$f":"IF(B363=\"\",0,IF(B363=D363,1,0))+IF(B365=\"\",0,IF(B365=D365,1,0))+IF(B367=\"\",0,IF(B367=D367,1,0))","v":0},{"$f":"IF(B363=\"\",0,+B363)+IF(B365=\"\",0,+B365)+IF(D367=\"\",0,+D367)","v":11},{"$f":"IF(D363=\"\",0,+D363)+IF(D365=\"\",0,+D365)+IF(B367=\"\",0,+B367)","v":2},{"$f":"L364-M364","v":9},{"$f":"I364*3+K364","v":9},null,"Patrizio Lazzaretti (ITA)",3,3,0,0,11,2,9,9]
[{"$f":"$B36","v":"Patrizio Lazzaretti (ITA)"},{"$f":"IF('Séries individuels'!D235=\"\",\"\",'Séries individuels'!D235)","v":3},"-",{"$f":"IF('Séries individuels'!F235=\"\",\"\",'Séries individuels'!F235)","v":1},{"$f":"$D36","v":"Justin Finch (ENG)"},null,{"$f":"E363","v":"Gregg Deinhart (USA)"},{"$f":"IF(D363=\"\",0,1)+IF(B366=\"\",0,1)+IF(B368=\"\",0,1)","v":3},{"$f":"IF(D363>B363,1,0)+IF(B366>D366,1,0)+IF(B368>D368,1,0)","v":0},{"$f":"IF(D363<B363,1,0)+IF(B366<D366,1,0)+IF(B368<D368,1,0)","v":3},{"$f":"IF(B363=\"\",0,IF(B363=D363,1,0))+IF(B366=\"\",0,IF(B366=D366,1,0))+IF(B368=\"\",0,IF(B368=D368,1,0))","v":0},{"$f":"IF(D363=\"\",0,+D363)+IF(B366=\"\",0,+B366)+IF(B368=\"\",0,+B368)","v":1},{"$f":"IF(B363=\"\",0,+B363)+IF(D366=\"\",0,+D366)+IF(D368=\"\",0,+D368)","v":9},{"$f":"L365-M365","v":-8},{"$f":"I365*3+K365","v":0},null,"Guy Palmer (GIB)",3,2,1,0,4,4,0,6]
[{"$f":"$C36","v":"Gregg Deinhart (USA)"},{"$f":"IF('Séries individuels'!D236=\"\",\"\",'Séries individuels'!D236)","v":0},"-",{"$f":"IF('Séries individuels'!F236=\"\",\"\",'Séries individuels'!F236)","v":1},{"$f":"$E36","v":"Guy Palmer (GIB)"},null,{"$f":"A364","v":"Justin Finch (ENG)"},{"$f":"IF(B364=\"\",0,1)+IF(D365=\"\",0,1)+IF(D368=\"\",0,1)","v":3},{"$f":"IF(B364>D364,1,0)+IF(D365>B365,1,0)+IF(D368>B368,1,0)","v":1},{"$f":"IF(B364<D364,1,0)+IF(D365<B365,1,0)+IF(D368<B368,1,0)","v":2},{"$f":"IF(B364=\"\",0,IF(B364=D364,1,0))+IF(B365=\"\",0,IF(B365=D365,1,0))+IF(B368=\"\",0,IF(B368=D368,1,0))","v":0},{"$f":"IF(B364=\"\",0,+B364)+IF(D365=\"\",0,+D365)+IF(D368=\"\",0,+D368)","v":5},{"$f":"IF(D364=\"\",0,+D364)+IF(B365=\"\",0,+B365)+IF(B368=\"\",0,+B368)","v":6},{"$f":"L366-M366","v":-1},{"$f":"I366*3+K366","v":3},null,"Justin Finch (ENG)",3,1,2,0,5,6,-1,3]
[{"$f":"$E36","v":"Guy Palmer (GIB)"},{"$f":"IF('Séries individuels'!D369=\"\",\"\",'Séries individuels'!D369)","v":1},"-",{"$f":"IF('Séries individuels'!F369=\"\",\"\",'Séries individuels'!F369)","v":4},{"$f":"$B36","v":"Patrizio Lazzaretti (ITA)"},null,{"$f":"E364","v":"Guy Palmer (GIB)"},{"$f":"IF(D364=\"\",0,1)+IF(D366=\"\",0,1)+IF(B367=\"\",0,1)","v":3},{"$f":"IF(D364>B364,1,0)+IF(D366>B366,1,0)+IF(B367>D367,1,0)","v":2},{"$f":"IF(D364<B364,1,0)+IF(D366<B366,1,0)+IF(B367<D367,1,0)","v":1},{"$f":"IF(B364=\"\",0,IF(B364=D364,1,0))+IF(B366=\"\",0,IF(B366=D366,1,0))+IF(B367=\"\",0,IF(B367=D367,1,0))","v":0},{"$f":"IF(D364=\"\",0,+D364)+IF(D366=\"\",0,+D366)+IF(B367=\"\",0,+B367)","v":4},{"$f":"IF(B364=\"\",0,+B364)+IF(B366=\"\",0,+B366)+IF(D367=\"\",0,+D367)","v":4},{"$f":"L367-M367","v":0},{"$f":"I367*3+K367","v":6},null,"Gregg Deinhart (USA)",3,0,3,0,1,9,-8,0]
[{"$f":"$C36","v":"Gregg Deinhart (USA)"},{"$f":"IF('Séries individuels'!D370=\"\",\"\",'Séries individuels'!D370)","v":1},"-",{"$f":"IF('Séries individuels'!F370=\"\",\"\",'Séries individuels'!F370)","v":4},{"$f":"$D36","v":"Justin Finch (ENG)"},null,null,null,{"$f":"SUM(I364:I367)","v":6},{"$f":"SUM(J364:J367)","v":6},{"$f":"SUM(K364:K367)","v":0},{"$f":"SUM(L364:L367)","v":21},{"$f":"SUM(M364:M367)","v":21},{"$f":"SUM(N364:N367)","v":0}]
[]
["Group 16"]
[]
[{"$f":"$B37","v":"David Busch (AUT)"},{"$f":"IF('Séries individuels'!D103=\"\",\"\",'Séries individuels'!D103)","v":0},"-",{"$f":"IF('Séries individuels'!F103=\"\",\"\",'Séries individuels'!F103)","v":2},{"$f":"$C37","v":"Massimo Cremona (MLT)"},null,null,"P","W","L","N","+","-","d","PTS",null,null,"P","W","L","N","+","-","d","PTS"]
[{"$f":"$D37","v":"Juan Carlos Granados (ESP)"},{"$f":"IF('Séries individuels'!D104=\"\",\"\",'Séries individuels'!D104)","v":4},"-",{"$f":"IF('Séries individuels'!F104=\"\",\"\",'Séries individuels'!F104)","v":2},{"$f":"$E37","v":"Vito Di Ruggiero (BEL)"},null,{"$f":"A372","v":"David Busch (AUT)"},{"$f":"IF(B372=\"\",0,1)+IF(B374=\"\",0,1)+IF(D376=\"\",0,1)","v":3},{"$f":"IF(B372>D372,1,0)+IF(B374>D374,1,0)+IF(D376>B376,1,0)","v":2},{"$f":"IF(B372<D372,1,0)+IF(B374<D374,1,0)+IF(D376<B376,1,0)","v":1},{"$f":"IF(B372=\"\",0,IF(B372=D372,1,0))+IF(B374=\"\",0,IF(B374=D374,1,0))+IF(B376=\"\",0,IF(B376=D376,1,0))","v":0},{"$f":"IF(B372=\"\",0,+B372)+IF(B374=\"\",0,+B374)+IF(D376=\"\",0,+D376)","v":6},{"$f":"IF(D372=\"\",0,+D372)+IF(D374=\"\",0,+D374)+IF(B376=\"\",0,+B376)","v":6},{"$f":"L373-M373","v":0},{"$f":"I373*3+K373","v":6},null,"Massimo Cremona (MLT)",3,3,0,0,8,1,7,9]
[{"$f":"$B37","v":"David Busch (AUT)"},{"$f":"IF('Séries individuels'!D237=\"\",\"\",'Séries individuels'!D237)","v":2},"-",{"$f":"IF('Séries individuels'!F237=\"\",\"\",'Séries individuels'!F237)","v":1},{"$f":"$D37","v":"Juan Carlos Granados (ESP)"},null,{"$f":"E372","v":"Massimo Cremona (MLT)"},{"$f":"IF(D372=\"\",0,1)+IF(B375=\"\",0,1)+IF(B377=\"\",0,1)","v":3},{"$f":"IF(D372>B372,1,0)+IF(B375>D375,1,0)+IF(B377>D377,1,0)","v":3},{"$f":"IF(D372<B372,1,0)+IF(B375<D375,1,0)+IF(B377<D377,1,0)","v":0},{"$f":"IF(B372=\"\",0,IF(B372=D372,1,0))+IF(B375=\"\",0,IF(B375=D375,1,0))+IF(B377=\"\",0,IF(B377=D377,1,0))","v":0},{"$f":"IF(D372=\"\",0,+D372)+IF(B375=\"\",0,+B375)+IF(B377=\"\",0,+B377)","v":8},{"$f":"IF(B372=\"\",0,+B372)+IF(D375=\"\",0,+D375)+IF(D377=\"\",0,+D377)","v":1},{"$f":"L374-M374","v":7},{"$f":"I374*3+K374","v":9},null,"David Busch (AUT)",3,2,1,0,6,6,0,6]
[{"$f":"$C37","v":"Massimo Cremona (MLT)"},{"$f":"IF('Séries individuels'!D238=\"\",\"\",'Séries individuels'!D238)","v":1},"-",{"$f":"IF('Séries individuels'!F238=\"\",\"\",'Séries individuels'!F238)","v":0},{"$f":"$E37","v":"Vito Di Ruggiero (BEL)"},null,{"$f":"A373","v":"Juan Carlos Granados (ESP)"},{"$f":"IF(B373=\"\",0,1)+IF(D374=\"\",0,1)+IF(D377=\"\",0,1)","v":3},{"$f":"IF(B373>D373,1,0)+IF(D374>B374,1,0)+IF(D377>B377,1,0)","v":1},{"$f":"IF(B373<D373,1,0)+IF(D374<B374,1,0)+IF(D377<B377,1,0)","v":2},{"$f":"IF(B373=\"\",0,IF(B373=D373,1,0))+IF(B374=\"\",0,IF(B374=D374,1,0))+IF(B377=\"\",0,IF(B377=D377,1,0))","v":0},{"$f":"IF(B373=\"\",0,+B373)+IF(D374=\"\",0,+D374)+IF(D377=\"\",0,+D377)","v":6},{"$f":"IF(D373=\"\",0,+D373)+IF(B374=\"\",0,+B374)+IF(B377=\"\",0,+B377)","v":9},{"$f":"L375-M375","v":-3},{"$f":"I375*3+K375","v":3},null,"Juan Carlos Granados (ESP)",3,1,2,0,6,9,-3,3]
[{"$f":"$E37","v":"Vito Di Ruggiero (BEL)"},{"$f":"IF('Séries individuels'!D371=\"\",\"\",'Séries individuels'!D371)","v":3},"-",{"$f":"IF('Séries individuels'!F371=\"\",\"\",'Séries individuels'!F371)","v":4},{"$f":"$B37","v":"David Busch (AUT)"},null,{"$f":"E373","v":"Vito Di Ruggiero (BEL)"},{"$f":"IF(D373=\"\",0,1)+IF(D375=\"\",0,1)+IF(B376=\"\",0,1)","v":3},{"$f":"IF(D373>B373,1,0)+IF(D375>B375,1,0)+IF(B376>D376,1,0)","v":0},{"$f":"IF(D373<B373,1,0)+IF(D375<B375,1,0)+IF(B376<D376,1,0)","v":3},{"$f":"IF(B373=\"\",0,IF(B373=D373,1,0))+IF(B375=\"\",0,IF(B375=D375,1,0))+IF(B376=\"\",0,IF(B376=D376,1,0))","v":0},{"$f":"IF(D373=\"\",0,+D373)+IF(D375=\"\",0,+D375)+IF(B376=\"\",0,+B376)","v":5},{"$f":"IF(B373=\"\",0,+B373)+IF(B375=\"\",0,+B375)+IF(D376=\"\",0,+D376)","v":9},{"$f":"L376-M376","v":-4},{"$f":"I376*3+K376","v":0},null,"Vito Di Ruggiero (BEL)",3,0,3,0,5,9,-4,0]
[{"$f":"$C37","v":"Massimo Cremona (MLT)"},{"$f":"IF('Séries individuels'!D372=\"\",\"\",'Séries individuels'!D372)","v":5},"-",{"$f":"IF('Séries individuels'!F372=\"\",\"\",'Séries individuels'!F372)","v":1},{"$f":"$D37","v":"Juan Carlos Granados (ESP)"},null,null,null,{"$f":"SUM(I373:I376)","v":6},{"$f":"SUM(J373:J376)","v":6},{"$f":"SUM(K373:K376)","v":0},{"$f":"SUM(L373:L376)","v":25},{"$f":"SUM(M373:M376)","v":25},{"$f":"SUM(N373:N376)","v":0}]
[]
[]
["Ladies category"]
[]
["Group 1"]
[]
[{"$f":"$B41","v":"Paola Forlani (ITA)"},{"$f":"IF('Séries individuels'!D38=\"\",\"\",'Séries individuels'!D38)","v":4},"-",{"$f":"IF('Séries individuels'!F38=\"\",\"\",'Séries individuels'!F38)","v":0},{"$f":"$C41","v":"Maike Krause (GER)"},null,null,"P","W","L","N","+","-","d","PTS",null,null,"P","W","L","N","+","-","d","PTS"]
[{"$f":"$D41","v":"Lydie Pinchart (BEL)"},{"$f":"IF('Séries individuels'!D39=\"\",\"\",'Séries individuels'!D39)","v":0},"-",{"$f":"IF('Séries individuels'!F39=\"\",\"\",'Séries individuels'!F39)","v":0},{"$f":"$E41","v":"Elodie Bertholet (BEL)"},null,{"$f":"A384","v":"Paola Forlani (ITA)"},{"$f":"IF(B384=\"\",0,1)+IF(B386=\"\",0,1)+IF(D388=\"\",0,1)","v":3},{"$f":"IF(B384>D384,1,0)+IF(B386>D386,1,0)+IF(D388>B388,1,0)","v":1},{"$f":"IF(B384<D384,1,0)+IF(B386<D386,1,0)+IF(D388<B388,1,0)","v":1},{"$f":"IF(B384=\"\",0,IF(B384=D384,1,0))+IF(B386=\"\",0,IF(B386=D386,1,0))+IF(B388=\"\",0,IF(B388=D388,1,0))","v":1},{"$f":"IF(B384=\"\",0,+B384)+IF(B386=\"\",0,+B386)+IF(D388=\"\",0,+D388)","v":8},{"$f":"IF(D384=\"\",0,+D384)+IF(D386=\"\",0,+D386)+IF(B388=\"\",0,+B388)","v":5},{"$f":"L385-M385","v":3},{"$f":"I385*3+K385","v":4},null,"Lydie Pinchart (BEL)",3,2,0,1,6,2,4,7]
[{"$f":"$B41","v":"Paola Forlani (ITA)"},{"$f":"IF('Séries individuels'!D172=\"\",\"\",'Séries individuels'!D172)","v":2},"-",{"$f":"IF('Séries individuels'!F172=\"\",\"\",'Séries individuels'!F172)","v":3},{"$f":"$D41","v":"Lydie Pinchart (BEL)"},null,{"$f":"E384","v":"Maike Krause (GER)"},{"$f":"IF(D384=\"\",0,1)+IF(B387=\"\",0,1)+IF(B389=\"\",0,1)","v":3},{"$f":"IF(D384>B384,1,0)+IF(B387>D387,1,0)+IF(B389>D389,1,0)","v":0},{"$f":"IF(D384<B384,1,0)+IF(B387<D387,1,0)+IF(B389<D389,1,0)","v":3},{"$f":"IF(B384=\"\",0,IF(B384=D384,1,0))+IF(B387=\"\",0,IF(B387=D387,1,0))+IF(B389=\"\",0,IF(B389=D389,1,0))","v":0},{"$f":"IF(D384=\"\",0,+D384)+IF(B387=\"\",0,+B387)+IF(B389=\"\",0,+B389)","v":0},{"$f":"IF(B384=\"\",0,+B384)+IF(D387=\"\",0,+D387)+IF(D389=\"\",0,+D389)","v":9},{"$f":"L386-M386","v":-9},{"$f":"I386*3+K386","v":0},null,"Elodie Bertholet (BEL)",3,1,0,2,4,2,2,5]
[{"$f":"$C41","v":"Maike Krause (GER)"},{"$f":"IF('Séries individuels'!D173=\"\",\"\",'Séries individuels'!D173)","v":0},"-",{"$f":"IF('Séries individuels'!F173=\"\",\"\",'Séries individuels'!F173)","v":2},{"$f":"$E41","v":"Elodie Bertholet (BEL)"},null,{"$f":"A385","v":"Lydie Pinchart (BEL)"},{"$f":"IF(B385=\"\",0,1)+IF(D386=\"\",0,1)+IF(D389=\"\",0,1)","v":3},{"$f":"IF(B385>D385,1,0)+IF(D386>B386,1,0)+IF(D389>B389,1,0)","v":2},{"$f":"IF(B385<D385,1,0)+IF(D386<B386,1,0)+IF(D389<B389,1,0)","v":0},{"$f":"IF(B385=\"\",0,IF(B385=D385,1,0))+IF(B386=\"\",0,IF(B386=D386,1,0))+IF(B389=\"\",0,IF(B389=D389,1,0))","v":1},{"$f":"IF(B385=\"\",0,+B385)+IF(D386=\"\",0,+D386)+IF(D389=\"\",0,+D389)","v":6},{"$f":"IF(D385=\"\",0,+D385)+IF(B386=\"\",0,+B386)+IF(B389=\"\",0,+B389)","v":2},{"$f":"L387-M387","v":4},{"$f":"I387*3+K387","v":7},null,"Paola Forlani (ITA)",3,1,1,1,8,5,3,4]
[{"$f":"$E41","v":"Elodie Bertholet (BEL)"},{"$f":"IF('Séries individuels'!D306=\"\",\"\",'Séries individuels'!D306)","v":2},"-",{"$f":"IF('Séries individuels'!F306=\"\",\"\",'Séries individuels'!F306)","v":2},{"$f":"$B41","v":"Paola Forlani (ITA)"},null,{"$f":"E385","v":"Elodie Bertholet (BEL)"},{"$f":"IF(D385=\"\",0,1)+IF(D387=\"\",0,1)+IF(B388=\"\",0,1)","v":3},{"$f":"IF(D385>B385,1,0)+IF(D387>B387,1,0)+IF(B388>D388,1,0)","v":1},{"$f":"IF(D385<B385,1,0)+IF(D387<B387,1,0)+IF(B388<D388,1,0)","v":0},{"$f":"IF(B385=\"\",0,IF(B385=D385,1,0))+IF(B387=\"\",0,IF(B387=D387,1,0))+IF(B388=\"\",0,IF(B388=D388,1,0))","v":2},{"$f":"IF(D385=\"\",0,+D385)+IF(D387=\"\",0,+D387)+IF(B388=\"\",0,+B388)","v":4},{"$f":"IF(B385=\"\",0,+B385)+IF(B387=\"\",0,+B387)+IF(D388=\"\",0,+D388)","v":2},{"$f":"L388-M388","v":2},{"$f":"I388*3+K388","v":5},null,"Maike Krause (GER)",3,0,3,0,0,9,-9,0]
[{"$f":"$C41","v":"Maike Krause (GER)"},{"$f":"IF('Séries individuels'!D307=\"\",\"\",'Séries individuels'!D307)","v":0},"-",{"$f":"IF('Séries individuels'!F307=\"\",\"\",'Séries individuels'!F307)","v":3},{"$f":"$D41","v":"Lydie Pinchart (BEL)"},null,null,null,{"$f":"SUM(I385:I388)","v":4},4,4,18,18,0]
[]
["Group 2"]
[]
[{"$f":"$B42","v":"Emilie Despretz (BEL)"},{"$f":"IF('Séries individuels'!D40=\"\",\"\",'Séries individuels'!D40)","v":5},"-",{"$f":"IF('Séries individuels'!F40=\"\",\"\",'Séries individuels'!F40)","v":0},{"$f":"$C42","v":"Arielle Briant (FRA)"},null,null,"P","W","L","N","+","-","d","PTS",null,null,"P","W","L","N","+","-","d","PTS"]
[{"$f":"$D42","v":"Paula Maireles  (ESP)"},{"$f":"IF('Séries individuels'!D41=\"\",\"\",'Séries individuels'!D41)","v":0},"-",{"$f":"IF('Séries individuels'!F41=\"\",\"\",'Séries individuels'!F41)","v":5},{"$f":"$E42","v":"Eleonora Buttitta (ITA)"},null,{"$f":"A393","v":"Emilie Despretz (BEL)"},{"$f":"IF(B393=\"\",0,1)+IF(B395=\"\",0,1)+IF(D397=\"\",0,1)","v":3},{"$f":"IF(B393>D393,1,0)+IF(B395>D395,1,0)+IF(D397>B397,1,0)","v":2},{"$f":"IF(B393<D393,1,0)+IF(B395<D395,1,0)+IF(D397<B397,1,0)","v":1},{"$f":"IF(B393=\"\",0,IF(B393=D393,1,0))+IF(B395=\"\",0,IF(B395=D395,1,0))+IF(B397=\"\",0,IF(B397=D397,1,0))","v":0},{"$f":"IF(B393=\"\",0,+B393)+IF(B395=\"\",0,+B395)+IF(D397=\"\",0,+D397)","v":12},{"$f":"IF(D393=\"\",0,+D393)+IF(D395=\"\",0,+D395)+IF(B397=\"\",0,+B397)","v":4},{"$f":"L394-M394","v":8},{"$f":"I394*3+K394","v":6},null,"Eleonora Buttitta (ITA)",3,3,0,0,11,3,8,9]
[{"$f":"$B42","v":"Emilie Despretz (BEL)"},{"$f":"IF('Séries individuels'!D174=\"\",\"\",'Séries individuels'!D174)","v":5},"-",{"$f":"IF('Séries individuels'!F174=\"\",\"\",'Séries individuels'!F174)","v":1},{"$f":"$D42","v":"Paula Maireles  (ESP)"},null,{"$f":"E393","v":"Arielle Briant (FRA)"},{"$f":"IF(D393=\"\",0,1)+IF(B396=\"\",0,1)+IF(B398=\"\",0,1)","v":3},{"$f":"IF(D393>B393,1,0)+IF(B396>D396,1,0)+IF(B398>D398,1,0)","v":0},{"$f":"IF(D393<B393,1,0)+IF(B396<D396,1,0)+IF(B398<D398,1,0)","v":3},{"$f":"IF(B393=\"\",0,IF(B393=D393,1,0))+IF(B396=\"\",0,IF(B396=D396,1,0))+IF(B398=\"\",0,IF(B398=D398,1,0))","v":0},{"$f":"IF(D393=\"\",0,+D393)+IF(B396=\"\",0,+B396)+IF(B398=\"\",0,+B398)","v":2},{"$f":"IF(B393=\"\",0,+B393)+IF(D396=\"\",0,+D396)+IF(D398=\"\",0,+D398)","v":10},{"$f":"L395-M395","v":-8},{"$f":"I395*3+K395","v":0},null,"Emilie Despretz (BEL)",3,2,1,0,12,4,8,6]
[{"$f":"$C42","v":"Arielle Briant (FRA)"},{"$f":"IF('Séries individuels'!D175=\"\",\"\",'Séries individuels'!D175)","v":1},"-",{"$f":"IF('Séries individuels'!F175=\"\",\"\",'Séries individuels'!F175)","v":3},{"$f":"$E42","v":"Eleonora Buttitta (ITA)"},null,{"$f":"A394","v":"Paula Maireles  (ESP)"},{"$f":"IF(B394=\"\",0,1)+IF(D395=\"\",0,1)+IF(D398=\"\",0,1)","v":3},{"$f":"IF(B394>D394,1,0)+IF(D395>B395,1,0)+IF(D398>B398,1,0)","v":1},{"$f":"IF(B394<D394,1,0)+IF(D395<B395,1,0)+IF(D398<B398,1,0)","v":2},{"$f":"IF(B394=\"\",0,IF(B394=D394,1,0))+IF(B395=\"\",0,IF(B395=D395,1,0))+IF(B398=\"\",0,IF(B398=D398,1,0))","v":0},{"$f":"IF(B394=\"\",0,+B394)+IF(D395=\"\",0,+D395)+IF(D398=\"\",0,+D398)","v":3},{"$f":"IF(D394=\"\",0,+D394)+IF(B395=\"\",0,+B395)+IF(B398=\"\",0,+B398)","v":11},{"$f":"L396-M396","v":-8},{"$f":"I396*3+K396","v":3},null,"Paula Maireles  (ESP)",3,1,2,0,3,11,-8,3]
[{"$f":"$E42","v":"Eleonora Buttitta (ITA)"},{"$f":"IF('Séries individuels'!D308=\"\",\"\",'Séries individuels'!D308)","v":3},"-",{"$f":"IF('Séries individuels'!F308=\"\",\"\",'Séries individuels'!F308)","v":2},{"$f":"$B42","v":"Emilie Despretz (BEL)"},null,{"$f":"E394","v":"Eleonora Buttitta (ITA)"},{"$f":"IF(D394=\"\",0,1)+IF(D396=\"\",0,1)+IF(B397=\"\",0,1)","v":3},{"$f":"IF(D394>B394,1,0)+IF(D396>B396,1,0)+IF(B397>D397,1,0)","v":3},{"$f":"IF(D394<B394,1,0)+IF(D396<B396,1,0)+IF(B397<D397,1,0)","v":0},{"$f":"IF(B394=\"\",0,IF(B394=D394,1,0))+IF(B396=\"\",0,IF(B396=D396,1,0))+IF(B397=\"\",0,IF(B397=D397,1,0))","v":0},{"$f":"IF(D394=\"\",0,+D394)+IF(D396=\"\",0,+D396)+IF(B397=\"\",0,+B397)","v":11},{"$f":"IF(B394=\"\",0,+B394)+IF(B396=\"\",0,+B396)+IF(D397=\"\",0,+D397)","v":3},{"$f":"L397-M397","v":8},{"$f":"I397*3+K397","v":9},null,"Arielle Briant (FRA)",3,0,3,0,2,10,-8,0]
[{"$f":"$C42","v":"Arielle Briant (FRA)"},{"$f":"IF('Séries individuels'!D309=\"\",\"\",'Séries individuels'!D309)","v":1},"-",{"$f":"IF('Séries individuels'!F309=\"\",\"\",'Séries individuels'!F309)","v":2},{"$f":"$D42","v":"Paula Maireles  (ESP)"},null,null,null,{"$f":"SUM(I394:I397)","v":6},6,0,28,28,0]
[]
["Group 3"]
[]
[{"$f":"$B43","v":"Audrey Herbaut (FRA)"},{"$f":"IF('Séries individuels'!D42=\"\",\"\",'Séries individuels'!D42)","v":2},"-",{"$f":"IF('Séries individuels'!F42=\"\",\"\",'Séries individuels'!F42)","v":0},{"$f":"$C43","v":"Alyssa Guyaux (BEL)"},null,null,"P","W","L","N","+","-","d","PTS",null,null,"P","W","L","N","+","-","d","PTS"]
[{"$f":"$D43","v":"Julia Eglicerio (ESP)"},{"$f":"IF('Séries individuels'!D43=\"\",\"\",'Séries individuels'!D43)","v":0},"-",{"$f":"IF('Séries individuels'!F43=\"\",\"\",'Séries individuels'!F43)","v":0},{"$f":"$E43","v":"Conny Vulpes (GER)"},null,{"$f":"A402","v":"Audrey Herbaut (FRA)"},{"$f":"IF(B402=\"\",0,1)+IF(B404=\"\",0,1)+IF(D406=\"\",0,1)","v":3},{"$f":"IF(B402>D402,1,0)+IF(B404>D404,1,0)+IF(D406>B406,1,0)","v":3},{"$f":"IF(B402<D402,1,0)+IF(B404<D404,1,0)+IF(D406<B406,1,0)","v":0},{"$f":"IF(B402=\"\",0,IF(B402=D402,1,0))+IF(B404=\"\",0,IF(B404=D404,1,0))+IF(B406=\"\",0,IF(B406=D406,1,0))","v":0},{"$f":"IF(B402=\"\",0,+B402)+IF(B404=\"\",0,+B404)+IF(D406=\"\",0,+D406)","v":12},{"$f":"IF(D402=\"\",0,+D402)+IF(D404=\"\",0,+D404)+IF(B406=\"\",0,+B406)","v":0},{"$f":"L403-M403","v":12},{"$f":"I403*3+K403","v":9},null,"Audrey Herbaut (FRA)",3,3,0,0,12,0,12,9]
[{"$f":"$B43","v":"Audrey Herbaut (FRA)"},{"$f":"IF('Séries individuels'!D176=\"\",\"\",'Séries individuels'!D176)","v":5},"-",{"$f":"IF('Séries individuels'!F176=\"\",\"\",'Séries individuels'!F176)","v":0},{"$f":"$D43","v":"Julia Eglicerio (ESP)"},null,{"$f":"E402","v":"Alyssa Guyaux (BEL)"},{"$f":"IF(D402=\"\",0,1)+IF(B405=\"\",0,1)+IF(B407=\"\",0,1)","v":3},{"$f":"IF(D402>B402,1,0)+IF(B405>D405,1,0)+IF(B407>D407,1,0)","v":0},{"$f":"IF(D402<B402,1,0)+IF(B405<D405,1,0)+IF(B407<D407,1,0)","v":1},{"$f":"IF(B402=\"\",0,IF(B402=D402,1,0))+IF(B405=\"\",0,IF(B405=D405,1,0))+IF(B407=\"\",0,IF(B407=D407,1,0))","v":2},{"$f":"IF(D402=\"\",0,+D402)+IF(B405=\"\",0,+B405)+IF(B407=\"\",0,+B407)","v":0},{"$f":"IF(B402=\"\",0,+B402)+IF(D405=\"\",0,+D405)+IF(D407=\"\",0,+D407)","v":2},{"$f":"L404-M404","v":-2},{"$f":"I404*3+K404","v":2},null,"Alyssa Guyaux (BEL)",3,0,1,2,0,2,-2,2]
[{"$f":"$C43","v":"Alyssa Guyaux (BEL)"},{"$f":"IF('Séries individuels'!D177=\"\",\"\",'Séries individuels'!D177)","v":0},"-",{"$f":"IF('Séries individuels'!F177=\"\",\"\",'Séries individuels'!F177)","v":0},{"$f":"$E43","v":"Conny Vulpes (GER)"},null,{"$f":"A403","v":"Julia Eglicerio (ESP)"},{"$f":"IF(B403=\"\",0,1)+IF(D404=\"\",0,1)+IF(D407=\"\",0,1)","v":3},{"$f":"IF(B403>D403,1,0)+IF(D404>B404,1,0)+IF(D407>B407,1,0)","v":0},{"$f":"IF(B403<D403,1,0)+IF(D404<B404,1,0)+IF(D407<B407,1,0)","v":1},{"$f":"IF(B403=\"\",0,IF(B403=D403,1,0))+IF(B404=\"\",0,IF(B404=D404,1,0))+IF(B407=\"\",0,IF(B407=D407,1,0))","v":2},{"$f":"IF(B403=\"\",0,+B403)+IF(D404=\"\",0,+D404)+IF(D407=\"\",0,+D407)","v":0},{"$f":"IF(D403=\"\",0,+D403)+IF(B404=\"\",0,+B404)+IF(B407=\"\",0,+B407)","v":5},{"$f":"L405-M405","v":-5},{"$f":"I405*3+K405","v":2},null,"Julia Eglicerio (ESP)",3,0,1,2,0,5,-5,2]
[{"$f":"$E43","v":"Conny Vulpes (GER)"},{"$f":"IF('Séries individuels'!D310=\"\",\"\",'Séries individuels'!D310)","v":0},"-",{"$f":"IF('Séries individuels'!F310=\"\",\"\",'Séries individuels'!F310)","v":5},{"$f":"$B43","v":"Audrey Herbaut (FRA)"},null,{"$f":"E403","v":"Conny Vulpes (GER)"},{"$f":"IF(D403=\"\",0,1)+IF(D405=\"\",0,1)+IF(B406=\"\",0,1)","v":3},{"$f":"IF(D403>B403,1,0)+IF(D405>B405,1,0)+IF(B406>D406,1,0)","v":0},{"$f":"IF(D403<B403,1,0)+IF(D405<B405,1,0)+IF(B406<D406,1,0)","v":1},{"$f":"IF(B403=\"\",0,IF(B403=D403,1,0))+IF(B405=\"\",0,IF(B405=D405,1,0))+IF(B406=\"\",0,IF(B406=D406,1,0))","v":2},{"$f":"IF(D403=\"\",0,+D403)+IF(D405=\"\",0,+D405)+IF(B406=\"\",0,+B406)","v":0},{"$f":"IF(B403=\"\",0,+B403)+IF(B405=\"\",0,+B405)+IF(D406=\"\",0,+D406)","v":5},{"$f":"L406-M406","v":-5},{"$f":"I406*3+K406","v":2},null,"Conny Vulpes (GER)",3,0,1,2,0,5,-5,2]
[{"$f":"$C43","v":"Alyssa Guyaux (BEL)"},{"$f":"IF('Séries individuels'!D311=\"\",\"\",'Séries individuels'!D311)","v":0},"-",{"$f":"IF('Séries individuels'!F311=\"\",\"\",'Séries individuels'!F311)","v":0},{"$f":"$D43","v":"Julia Eglicerio (ESP)"},null,null,null,{"$f":"SUM(I403:I406)","v":3},3,6,12,12,0]
[]
["Group 4"]
[]
[{"$f":"$B44","v":"Victoria Büsing (GER)"},{"$f":"IF('Séries individuels'!D44=\"\",\"\",'Séries individuels'!D44)","v":2},"-",{"$f":"IF('Séries individuels'!F44=\"\",\"\",'Séries individuels'!F44)","v":0},{"$f":"$C44","v":"Carolina Villarigues (POR)"},null,null,"P","W","L","N","+","-","d","PTS",null,null,"P","W","L","N","+","-","d","PTS"]
[{"$f":"$D44","v":"Manon Willem (BEL)"},{"$f":"IF('Séries individuels'!D45=\"\",\"\",'Séries individuels'!D45)","v":1},"-",{"$f":"IF('Séries individuels'!F45=\"\",\"\",'Séries individuels'!F45)","v":0},{"$f":"$E44","v":"Kimberley Devreese (BEL)"},null,{"$f":"A411","v":"Victoria Büsing (GER)"},{"$f":"IF(B411=\"\",0,1)+IF(B413=\"\",0,1)+IF(D415=\"\",0,1)","v":3},{"$f":"IF(B411>D411,1,0)+IF(B413>D413,1,0)+IF(D415>B415,1,0)","v":3},{"$f":"IF(B411<D411,1,0)+IF(B413<D413,1,0)+IF(D415<B415,1,0)","v":0},{"$f":"IF(B411=\"\",0,IF(B411=D411,1,0))+IF(B413=\"\",0,IF(B413=D413,1,0))+IF(B415=\"\",0,IF(B415=D415,1,0))","v":0},{"$f":"IF(B411=\"\",0,+B411)+IF(B413=\"\",0,+B413)+IF(D415=\"\",0,+D415)","v":9},{"$f":"IF(D411=\"\",0,+D411)+IF(D413=\"\",0,+D413)+IF(B415=\"\",0,+B415)","v":0},{"$f":"L412-M412","v":9},{"$f":"I412*3+K412","v":9},null,"Victoria Büsing (GER)",3,3,0,0,9,0,9,9]
[{"$f":"$B44","v":"Victoria Büsing (GER)"},{"$f":"IF('Séries individuels'!D178=\"\",\"\",'Séries individuels'!D178)","v":2},"-",{"$f":"IF('Séries individuels'!F178=\"\",\"\",'Séries individuels'!F178)","v":0},{"$f":"$D44","v":"Manon Willem (BEL)"},null,{"$f":"E411","v":"Carolina Villarigues (POR)"},{"$f":"IF(D411=\"\",0,1)+IF(B414=\"\",0,1)+IF(B416=\"\",0,1)","v":3},{"$f":"IF(D411>B411,1,0)+IF(B414>D414,1,0)+IF(B416>D416,1,0)","v":2},{"$f":"IF(D411<B411,1,0)+IF(B414<D414,1,0)+IF(B416<D416,1,0)","v":1},{"$f":"IF(B411=\"\",0,IF(B411=D411,1,0))+IF(B414=\"\",0,IF(B414=D414,1,0))+IF(B416=\"\",0,IF(B416=D416,1,0))","v":0},{"$f":"IF(D411=\"\",0,+D411)+IF(B414=\"\",0,+B414)+IF(B416=\"\",0,+B416)","v":8},{"$f":"IF(B411=\"\",0,+B411)+IF(D414=\"\",0,+D414)+IF(D416=\"\",0,+D416)","v":2},{"$f":"L413-M413","v":6},{"$f":"I413*3+K413","v":6},null,"Carolina Villarigues (POR)",3,2,1,0,8,2,6,6]
[{"$f":"$C44","v":"Carolina Villarigues (POR)"},{"$f":"IF('Séries individuels'!D179=\"\",\"\",'Séries individuels'!D179)","v":5},"-",{"$f":"IF('Séries individuels'!F179=\"\",\"\",'Séries individuels'!F179)","v":0},{"$f":"$E44","v":"Kimberley Devreese (BEL)"},null,{"$f":"A412","v":"Manon Willem (BEL)"},{"$f":"IF(B412=\"\",0,1)+IF(D413=\"\",0,1)+IF(D416=\"\",0,1)","v":3},{"$f":"IF(B412>D412,1,0)+IF(D413>B413,1,0)+IF(D416>B416,1,0)","v":1},{"$f":"IF(B412<D412,1,0)+IF(D413<B413,1,0)+IF(D416<B416,1,0)","v":2},{"$f":"IF(B412=\"\",0,IF(B412=D412,1,0))+IF(B413=\"\",0,IF(B413=D413,1,0))+IF(B416=\"\",0,IF(B416=D416,1,0))","v":0},{"$f":"IF(B412=\"\",0,+B412)+IF(D413=\"\",0,+D413)+IF(D416=\"\",0,+D416)","v":1},{"$f":"IF(D412=\"\",0,+D412)+IF(B413=\"\",0,+B413)+IF(B416=\"\",0,+B416)","v":5},{"$f":"L414-M414","v":-4},{"$f":"I414*3+K414","v":3},null,"Manon Willem (BEL)",3,1,2,0,1,5,-4,3]
[{"$f":"$E44","v":"Kimberley Devreese (BEL)"},{"$f":"IF('Séries individuels'!D312=\"\",\"\",'Séries individuels'!D312)","v":0},"-",{"$f":"IF('Séries individuels'!F312=\"\",\"\",'Séries individuels'!F312)","v":5},{"$f":"$B44","v":"Victoria Büsing (GER)"},null,{"$f":"E412","v":"Kimberley Devreese (BEL)"},{"$f":"IF(D412=\"\",0,1)+IF(D414=\"\",0,1)+IF(B415=\"\",0,1)","v":3},{"$f":"IF(D412>B412,1,0)+IF(D414>B414,1,0)+IF(B415>D415,1,0)","v":0},{"$f":"IF(D412<B412,1,0)+IF(D414<B414,1,0)+IF(B415<D415,1,0)","v":3},{"$f":"IF(B412=\"\",0,IF(B412=D412,1,0))+IF(B414=\"\",0,IF(B414=D414,1,0))+IF(B415=\"\",0,IF(B415=D415,1,0))","v":0},{"$f":"IF(D412=\"\",0,+D412)+IF(D414=\"\",0,+D414)+IF(B415=\"\",0,+B415)","v":0},{"$f":"IF(B412=\"\",0,+B412)+IF(B414=\"\",0,+B414)+IF(D415=\"\",0,+D415)","v":11},{"$f":"L415-M415","v":-11},{"$f":"I415*3+K415","v":0},null,"Kimberley Devreese (BEL)",3,0,3,0,0,11,-11,0]
[{"$f":"$C44","v":"Carolina Villarigues (POR)"},{"$f":"IF('Séries individuels'!D313=\"\",\"\",'Séries individuels'!D313)","v":3},"-",{"$f":"IF('Séries individuels'!F313=\"\",\"\",'Séries individuels'!F313)","v":0},{"$f":"$D44","v":"Manon Willem (BEL)"},null,null,null,{"$f":"SUM(I412:I415)","v":6},6,0,18,18,0]
[]
["Group 5"]
[]
[{"$f":"$B45","v":"Delphine Dieudonne (BEL)"},{"$f":"IF('Séries individuels'!D105=\"\",\"\",'Séries individuels'!D105)","v":3},"-",{"$f":"IF('Séries individuels'!F105=\"\",\"\",'Séries individuels'!F105)","v":1},{"$f":"$C45","v":"Mélanie Falcone (BEL)"},null,null,"P","W","L","N","+","-","d","PTS",null,null,"P","W","L","N","+","-","d","PTS"]
[{"$f":"$D45","v":"Mirjam de Jong (NED)"},{"$f":"IF('Séries individuels'!D106=\"\",\"\",'Séries individuels'!D106)","v":0},"-",{"$f":"IF('Séries individuels'!F106=\"\",\"\",'Séries individuels'!F106)","v":3},{"$f":"$E45","v":"Helène Boniface (ITA)"},null,{"$f":"A420","v":"Delphine Dieudonne (BEL)"},{"$f":"IF(B420=\"\",0,1)+IF(B422=\"\",0,1)+IF(D424=\"\",0,1)","v":3},{"$f":"IF(B420>D420,1,0)+IF(B422>D422,1,0)+IF(D424>B424,1,0)","v":3},{"$f":"IF(B420<D420,1,0)+IF(B422<D422,1,0)+IF(D424<B424,1,0)","v":0},{"$f":"IF(B420=\"\",0,IF(B420=D420,1,0))+IF(B422=\"\",0,IF(B422=D422,1,0))+IF(B424=\"\",0,IF(B424=D424,1,0))","v":0},{"$f":"IF(B420=\"\",0,+B420)+IF(B422=\"\",0,+B422)+IF(D424=\"\",0,+D424)","v":13},{"$f":"IF(D420=\"\",0,+D420)+IF(D422=\"\",0,+D422)+IF(B424=\"\",0,+B424)","v":2},{"$f":"L421-M421","v":11},{"$f":"I421*3+K421","v":9},null,"Delphine Dieudonne (BEL)",3,3,0,0,13,2,11,9]
[{"$f":"$B45","v":"Delphine Dieudonne (BEL)"},{"$f":"IF('Séries individuels'!D239=\"\",\"\",'Séries individuels'!D239)","v":5},"-",{"$f":"IF('Séries individuels'!F239=\"\",\"\",'Séries individuels'!F239)","v":0},{"$f":"$D45","v":"Mirjam de Jong (NED)"},null,{"$f":"E420","v":"Mélanie Falcone (BEL)"},{"$f":"IF(D420=\"\",0,1)+IF(B423=\"\",0,1)+IF(B425=\"\",0,1)","v":3},{"$f":"IF(D420>B420,1,0)+IF(B423>D423,1,0)+IF(B425>D425,1,0)","v":1},{"$f":"IF(D420<B420,1,0)+IF(B423<D423,1,0)+IF(B425<D425,1,0)","v":2},{"$f":"IF(B420=\"\",0,IF(B420=D420,1,0))+IF(B423=\"\",0,IF(B423=D423,1,0))+IF(B425=\"\",0,IF(B425=D425,1,0))","v":0},{"$f":"IF(D420=\"\",0,+D420)+IF(B423=\"\",0,+B423)+IF(B425=\"\",0,+B425)","v":2},{"$f":"IF(B420=\"\",0,+B420)+IF(D423=\"\",0,+D423)+IF(D425=\"\",0,+D425)","v":4},{"$f":"L422-M422","v":-2},{"$f":"I422*3+K422","v":3},null,"Helène Boniface (ITA)",3,2,1,0,5,5,0,6]
[{"$f":"$C45","v":"Mélanie Falcone (BEL)"},{"$f":"IF('Séries individuels'!D240=\"\",\"\",'Séries individuels'!D240)","v":0},"-",{"$f":"IF('Séries individuels'!F240=\"\",\"\",'Séries individuels'!F240)","v":1},{"$f":"$E45","v":"Helène Boniface (ITA)"},null,{"$f":"A421","v":"Mirjam de Jong (NED)"},{"$f":"IF(B421=\"\",0,1)+IF(D422=\"\",0,1)+IF(D425=\"\",0,1)","v":3},{"$f":"IF(B421>D421,1,0)+IF(D422>B422,1,0)+IF(D425>B425,1,0)","v":0},{"$f":"IF(B421<D421,1,0)+IF(D422<B422,1,0)+IF(D425<B425,1,0)","v":3},{"$f":"IF(B421=\"\",0,IF(B421=D421,1,0))+IF(B422=\"\",0,IF(B422=D422,1,0))+IF(B425=\"\",0,IF(B425=D425,1,0))","v":0},{"$f":"IF(B421=\"\",0,+B421)+IF(D422=\"\",0,+D422)+IF(D425=\"\",0,+D425)","v":0},{"$f":"IF(D421=\"\",0,+D421)+IF(B422=\"\",0,+B422)+IF(B425=\"\",0,+B425)","v":9},{"$f":"L423-M423","v":-9},{"$f":"I423*3+K423","v":0},null,"Mélanie Falcone (BEL)",3,1,2,0,2,4,-2,3]
[{"$f":"$E45","v":"Helène Boniface (ITA)"},{"$f":"IF('Séries individuels'!D373=\"\",\"\",'Séries individuels'!D373)","v":1},"-",{"$f":"IF('Séries individuels'!F373=\"\",\"\",'Séries individuels'!F373)","v":5},{"$f":"$B45","v":"Delphine Dieudonne (BEL)"},null,{"$f":"E421","v":"Helène Boniface (ITA)"},{"$f":"IF(D421=\"\",0,1)+IF(D423=\"\",0,1)+IF(B424=\"\",0,1)","v":3},{"$f":"IF(D421>B421,1,0)+IF(D423>B423,1,0)+IF(B424>D424,1,0)","v":2},{"$f":"IF(D421<B421,1,0)+IF(D423<B423,1,0)+IF(B424<D424,1,0)","v":1},{"$f":"IF(B421=\"\",0,IF(B421=D421,1,0))+IF(B423=\"\",0,IF(B423=D423,1,0))+IF(B424=\"\",0,IF(B424=D424,1,0))","v":0},{"$f":"IF(D421=\"\",0,+D421)+IF(D423=\"\",0,+D423)+IF(B424=\"\",0,+B424)","v":5},{"$f":"IF(B421=\"\",0,+B421)+IF(B423=\"\",0,+B423)+IF(D424=\"\",0,+D424)","v":5},{"$f":"L424-M424","v":0},{"$f":"I424*3+K424","v":6},null,"Mirjam de Jong (NED)",3,0,3,0,0,9,-9,0]
[{"$f":"$C45","v":"Mélanie Falcone (BEL)"},{"$f":"IF('Séries individuels'!D374=\"\",\"\",'Séries individuels'!D374)","v":1},"-",{"$f":"IF('Séries individuels'!F374=\"\",\"\",'Séries individuels'!F374)","v":0},{"$f":"$D45","v":"Mirjam de Jong (NED)"},null,null,null,{"$f":"SUM(I421:I424)","v":6},6,0,20,20,0]
[]
["Group 6"]
[]
[{"$f":"$B46","v":"Giulia Brillantino (ITA)"},{"$f":"IF('Séries individuels'!D107=\"\",\"\",'Séries individuels'!D107)","v":1},"-",{"$f":"IF('Séries individuels'!F107=\"\",\"\",'Séries individuels'!F107)","v":1},{"$f":"$C46","v":"Françoise Guyot (FRA)"},null,null,"P","W","L","N","+","-","d","PTS",null,null,"P","W","L","N","+","-","d","PTS"]
[{"$f":"$D46","v":"Daria Prazynski (GER)"},{"$f":"IF('Séries individuels'!D108=\"\",\"\",'Séries individuels'!D108)","v":0},"-",{"$f":"IF('Séries individuels'!F108=\"\",\"\",'Séries individuels'!F108)","v":4},{"$f":"$E46","v":"Cynthia Bouchez (BEL)"},null,{"$f":"A429","v":"Giulia Brillantino (ITA)"},{"$f":"IF(B429=\"\",0,1)+IF(B431=\"\",0,1)+IF(D433=\"\",0,1)","v":3},{"$f":"IF(B429>D429,1,0)+IF(B431>D431,1,0)+IF(D433>B433,1,0)","v":2},{"$f":"IF(B429<D429,1,0)+IF(B431<D431,1,0)+IF(D433<B433,1,0)","v":0},{"$f":"IF(B429=\"\",0,IF(B429=D429,1,0))+IF(B431=\"\",0,IF(B431=D431,1,0))+IF(B433=\"\",0,IF(B433=D433,1,0))","v":1},{"$f":"IF(B429=\"\",0,+B429)+IF(B431=\"\",0,+B431)+IF(D433=\"\",0,+D433)","v":3},{"$f":"IF(D429=\"\",0,+D429)+IF(D431=\"\",0,+D431)+IF(B433=\"\",0,+B433)","v":1},{"$f":"L430-M430","v":2},{"$f":"I430*3+K430","v":7},null,"Giulia Brillantino (ITA)",3,2,0,1,3,1,2,7]
[{"$f":"$B46","v":"Giulia Brillantino (ITA)"},{"$f":"IF('Séries individuels'!D241=\"\",\"\",'Séries individuels'!D241)","v":1},"-",{"$f":"IF('Séries individuels'!F241=\"\",\"\",'Séries individuels'!F241)","v":0},{"$f":"$D46","v":"Daria Prazynski (GER)"},null,{"$f":"E429","v":"Françoise Guyot (FRA)"},{"$f":"IF(D429=\"\",0,1)+IF(B432=\"\",0,1)+IF(B434=\"\",0,1)","v":3},{"$f":"IF(D429>B429,1,0)+IF(B432>D432,1,0)+IF(B434>D434,1,0)","v":1},{"$f":"IF(D429<B429,1,0)+IF(B432<D432,1,0)+IF(B434<D434,1,0)","v":0},{"$f":"IF(B429=\"\",0,IF(B429=D429,1,0))+IF(B432=\"\",0,IF(B432=D432,1,0))+IF(B434=\"\",0,IF(B434=D434,1,0))","v":2},{"$f":"IF(D429=\"\",0,+D429)+IF(B432=\"\",0,+B432)+IF(B434=\"\",0,+B434)","v":4},{"$f":"IF(B429=\"\",0,+B429)+IF(D432=\"\",0,+D432)+IF(D434=\"\",0,+D434)","v":3},{"$f":"L431-M431","v":1},{"$f":"I431*3+K431","v":5},null,"Françoise Guyot (FRA)",3,1,0,2,4,3,1,5]
[{"$f":"$C46","v":"Françoise Guyot (FRA)"},{"$f":"IF('Séries individuels'!D242=\"\",\"\",'Séries individuels'!D242)","v":1},"-",{"$f":"IF('Séries individuels'!F242=\"\",\"\",'Séries individuels'!F242)","v":1},{"$f":"$E46","v":"Cynthia Bouchez (BEL)"},null,{"$f":"A430","v":"Daria Prazynski (GER)"},{"$f":"IF(B430=\"\",0,1)+IF(D431=\"\",0,1)+IF(D434=\"\",0,1)","v":3},{"$f":"IF(B430>D430,1,0)+IF(D431>B431,1,0)+IF(D434>B434,1,0)","v":0},{"$f":"IF(B430<D430,1,0)+IF(D431<B431,1,0)+IF(D434<B434,1,0)","v":3},{"$f":"IF(B430=\"\",0,IF(B430=D430,1,0))+IF(B431=\"\",0,IF(B431=D431,1,0))+IF(B434=\"\",0,IF(B434=D434,1,0))","v":0},{"$f":"IF(B430=\"\",0,+B430)+IF(D431=\"\",0,+D431)+IF(D434=\"\",0,+D434)","v":1},{"$f":"IF(D430=\"\",0,+D430)+IF(B431=\"\",0,+B431)+IF(B434=\"\",0,+B434)","v":7},{"$f":"L432-M432","v":-6},{"$f":"I432*3+K432","v":0},null,"Cynthia Bouchez (BEL)",3,1,1,1,5,2,3,4]
[{"$f":"$E46","v":"Cynthia Bouchez (BEL)"},{"$f":"IF('Séries individuels'!D375=\"\",\"\",'Séries individuels'!D375)","v":0},"-",{"$f":"IF('Séries individuels'!F375=\"\",\"\",'Séries individuels'!F375)","v":1},{"$f":"$B46","v":"Giulia Brillantino (ITA)"},null,{"$f":"E430","v":"Cynthia Bouchez (BEL)"},{"$f":"IF(D430=\"\",0,1)+IF(D432=\"\",0,1)+IF(B433=\"\",0,1)","v":3},{"$f":"IF(D430>B430,1,0)+IF(D432>B432,1,0)+IF(B433>D433,1,0)","v":1},{"$f":"IF(D430<B430,1,0)+IF(D432<B432,1,0)+IF(B433<D433,1,0)","v":1},{"$f":"IF(B430=\"\",0,IF(B430=D430,1,0))+IF(B432=\"\",0,IF(B432=D432,1,0))+IF(B433=\"\",0,IF(B433=D433,1,0))","v":1},{"$f":"IF(D430=\"\",0,+D430)+IF(D432=\"\",0,+D432)+IF(B433=\"\",0,+B433)","v":5},{"$f":"IF(B430=\"\",0,+B430)+IF(B432=\"\",0,+B432)+IF(D433=\"\",0,+D433)","v":2},{"$f":"L433-M433","v":3},{"$f":"I433*3+K433","v":4},null,"Daria Prazynski (GER)",3,0,3,0,1,7,-6,0]
[{"$f":"$C46","v":"Françoise Guyot (FRA)"},{"$f":"IF('Séries individuels'!D376=\"\",\"\",'Séries individuels'!D376)","v":2},"-",{"$f":"IF('Séries individuels'!F376=\"\",\"\",'Séries individuels'!F376)","v":1},{"$f":"$D46","v":"Daria Prazynski (GER)"},null,null,null,{"$f":"SUM(I430:I433)","v":4},4,4,13,13,0]
[]
["Group 7"]
[]
[{"$f":"$B47","v":"Margault Delval (BEL)"},{"$f":"IF('Séries individuels'!D109=\"\",\"\",'Séries individuels'!D109)","v":5},"-",{"$f":"IF('Séries individuels'!F109=\"\",\"\",'Séries individuels'!F109)","v":0},{"$f":"$C47","v":"Isabelle Daelman (BEL)"},null,null,"P","W","L","N","+","-","d","PTS",null,null,"P","W","L","N","+","-","d","PTS"]
[{"$f":"$D47","v":"Giuditta Lo Cascio (ITA)"},{"$f":"IF('Séries individuels'!D110=\"\",\"\",'Séries individuels'!D110)","v":3},"-",{"$f":"IF('Séries individuels'!F110=\"\",\"\",'Séries individuels'!F110)","v":0},{"$f":"$E47","v":"Sylvie Guyot (FRA)"},null,{"$f":"A438","v":"Margault Delval (BEL)"},{"$f":"IF(B438=\"\",0,1)+IF(B440=\"\",0,1)+IF(D442=\"\",0,1)","v":3},{"$f":"IF(B438>D438,1,0)+IF(B440>D440,1,0)+IF(D442>B442,1,0)","v":1},{"$f":"IF(B438<D438,1,0)+IF(B440<D440,1,0)+IF(D442<B442,1,0)","v":1},{"$f":"IF(B438=\"\",0,IF(B438=D438,1,0))+IF(B440=\"\",0,IF(B440=D440,1,0))+IF(B442=\"\",0,IF(B442=D442,1,0))","v":1},{"$f":"IF(B438=\"\",0,+B438)+IF(B440=\"\",0,+B440)+IF(D442=\"\",0,+D442)","v":7},{"$f":"IF(D438=\"\",0,+D438)+IF(D440=\"\",0,+D440)+IF(B442=\"\",0,+B442)","v":5},{"$f":"L439-M439","v":2},{"$f":"I439*3+K439","v":4},null,"Giuditta Lo Cascio (ITA)",3,3,0,0,11,0,11,9]
[{"$f":"$B47","v":"Margault Delval (BEL)"},{"$f":"IF('Séries individuels'!D243=\"\",\"\",'Séries individuels'!D243)","v":0},"-",{"$f":"IF('Séries individuels'!F243=\"\",\"\",'Séries individuels'!F243)","v":3},{"$f":"$D47","v":"Giuditta Lo Cascio (ITA)"},null,{"$f":"E438","v":"Isabelle Daelman (BEL)"},{"$f":"IF(D438=\"\",0,1)+IF(B441=\"\",0,1)+IF(B443=\"\",0,1)","v":3},{"$f":"IF(D438>B438,1,0)+IF(B441>D441,1,0)+IF(B443>D443,1,0)","v":0},{"$f":"IF(D438<B438,1,0)+IF(B441<D441,1,0)+IF(B443<D443,1,0)","v":3},{"$f":"IF(B438=\"\",0,IF(B438=D438,1,0))+IF(B441=\"\",0,IF(B441=D441,1,0))+IF(B443=\"\",0,IF(B443=D443,1,0))","v":0},{"$f":"IF(D438=\"\",0,+D438)+IF(B441=\"\",0,+B441)+IF(B443=\"\",0,+B443)","v":0},{"$f":"IF(B438=\"\",0,+B438)+IF(D441=\"\",0,+D441)+IF(D443=\"\",0,+D443)","v":13},{"$f":"L440-M440","v":-13},{"$f":"I440*3+K440","v":0},null,"Margault Delval (BEL)",3,1,1,1,7,5,2,4]
[{"$f":"$C47","v":"Isabelle Daelman (BEL)"},{"$f":"IF('Séries individuels'!D244=\"\",\"\",'Séries individuels'!D244)","v":0},"-",{"$f":"IF('Séries individuels'!F244=\"\",\"\",'Séries individuels'!F244)","v":3},{"$f":"$E47","v":"Sylvie Guyot (FRA)"},null,{"$f":"A439","v":"Giuditta Lo Cascio (ITA)"},{"$f":"IF(B439=\"\",0,1)+IF(D440=\"\",0,1)+IF(D443=\"\",0,1)","v":3},{"$f":"IF(B439>D439,1,0)+IF(D440>B440,1,0)+IF(D443>B443,1,0)","v":3},{"$f":"IF(B439<D439,1,0)+IF(D440<B440,1,0)+IF(D443<B443,1,0)","v":0},{"$f":"IF(B439=\"\",0,IF(B439=D439,1,0))+IF(B440=\"\",0,IF(B440=D440,1,0))+IF(B443=\"\",0,IF(B443=D443,1,0))","v":0},{"$f":"IF(B439=\"\",0,+B439)+IF(D440=\"\",0,+D440)+IF(D443=\"\",0,+D443)","v":11},{"$f":"IF(D439=\"\",0,+D439)+IF(B440=\"\",0,+B440)+IF(B443=\"\",0,+B443)","v":0},{"$f":"L441-M441","v":11},{"$f":"I441*3+K441","v":9},null,"Sylvie Guyot (FRA)",3,1,1,1,5,5,0,4]
[{"$f":"$E47","v":"Sylvie Guyot (FRA)"},{"$f":"IF('Séries individuels'!D377=\"\",\"\",'Séries individuels'!D377)","v":2},"-",{"$f":"IF('Séries individuels'!F377=\"\",\"\",'Séries individuels'!F377)","v":2},{"$f":"$B47","v":"Margault Delval (BEL)"},null,{"$f":"E439","v":"Sylvie Guyot (FRA)"},{"$f":"IF(D439=\"\",0,1)+IF(D441=\"\",0,1)+IF(B442=\"\",0,1)","v":3},{"$f":"IF(D439>B439,1,0)+IF(D441>B441,1,0)+IF(B442>D442,1,0)","v":1},{"$f":"IF(D439<B439,1,0)+IF(D441<B441,1,0)+IF(B442<D442,1,0)","v":1},{"$f":"IF(B439=\"\",0,IF(B439=D439,1,0))+IF(B441=\"\",0,IF(B441=D441,1,0))+IF(B442=\"\",0,IF(B442=D442,1,0))","v":1},{"$f":"IF(D439=\"\",0,+D439)+IF(D441=\"\",0,+D441)+IF(B442=\"\",0,+B442)","v":5},{"$f":"IF(B439=\"\",0,+B439)+IF(B441=\"\",0,+B441)+IF(D442=\"\",0,+D442)","v":5},{"$f":"L442-M442","v":0},{"$f":"I442*3+K442","v":4},null,"Isabelle Daelman (BEL)",3,0,3,0,0,13,-13,0]
[{"$f":"$C47","v":"Isabelle Daelman (BEL)"},{"$f":"IF('Séries individuels'!D378=\"\",\"\",'Séries individuels'!D378)","v":0},"-",{"$f":"IF('Séries individuels'!F378=\"\",\"\",'Séries individuels'!F378)","v":5},{"$f":"$D47","v":"Giuditta Lo Cascio (ITA)"},null,null,null,{"$f":"SUM(I439:I442)","v":5},5,2,23,23,0]
[]
[]
["U19 category"]
[]
["Group 1"]
[]
[{"$f":"$B52","v":"Florian Giaux (BEL)"},{"$f":"IF('Séries individuels'!D46=\"\",\"\",'Séries individuels'!D46)","v":5},"-",{"$f":"IF('Séries individuels'!F46=\"\",\"\",'Séries individuels'!F46)","v":0},{"$f":"$C52","v":"Jody Henrioul (BEL)"},null,null,"P","W","L","N","+","-","d","PTS",null,null,"P","W","L","N","+","-","d","PTS"]
[{"$f":"$D52","v":"Connor Bowden (ENG)"},{"$f":"IF('Séries individuels'!D47=\"\",\"\",'Séries individuels'!D47)","v":0},"-",{"$f":"IF('Séries individuels'!F47=\"\",\"\",'Séries individuels'!F47)","v":5},{"$f":"$E52","v":"Nikos Haratsis (GRE)"},null,{"$f":"A450","v":"Florian Giaux (BEL)"},{"$f":"IF(B450=\"\",0,1)+IF(B452=\"\",0,1)+IF(D454=\"\",0,1)","v":3},{"$f":"IF(B450>D450,1,0)+IF(B452>D452,1,0)+IF(D454>B454,1,0)","v":3},{"$f":"IF(B450<D450,1,0)+IF(B452<D452,1,0)+IF(D454<B454,1,0)","v":0},{"$f":"IF(B450=\"\",0,IF(B450=D450,1,0))+IF(B452=\"\",0,IF(B452=D452,1,0))+IF(B454=\"\",0,IF(B454=D454,1,0))","v":0},{"$f":"IF(B450=\"\",0,+B450)+IF(B452=\"\",0,+B452)+IF(D454=\"\",0,+D454)","v":14},{"$f":"IF(D450=\"\",0,+D450)+IF(D452=\"\",0,+D452)+IF(B454=\"\",0,+B454)","v":4},{"$f":"L451-M451","v":10},{"$f":"I451*3+K451","v":9},null,"Florian Giaux (BEL)",3,3,0,0,14,4,10,9]
[{"$f":"$B52","v":"Florian Giaux (BEL)"},{"$f":"IF('Séries individuels'!D180=\"\",\"\",'Séries individuels'!D180)","v":2},"-",{"$f":"IF('Séries individuels'!F180=\"\",\"\",'Séries individuels'!F180)","v":0},{"$f":"$D52","v":"Connor Bowden (ENG)"},null,{"$f":"E450","v":"Jody Henrioul (BEL)"},{"$f":"IF(D450=\"\",0,1)+IF(B453=\"\",0,1)+IF(B455=\"\",0,1)","v":3},{"$f":"IF(D450>B450,1,0)+IF(B453>D453,1,0)+IF(B455>D455,1,0)","v":1},{"$f":"IF(D450<B450,1,0)+IF(B453<D453,1,0)+IF(B455<D455,1,0)","v":2},{"$f":"IF(B450=\"\",0,IF(B450=D450,1,0))+IF(B453=\"\",0,IF(B453=D453,1,0))+IF(B455=\"\",0,IF(B455=D455,1,0))","v":0},{"$f":"IF(D450=\"\",0,+D450)+IF(B453=\"\",0,+B453)+IF(B455=\"\",0,+B455)","v":2},{"$f":"IF(B450=\"\",0,+B450)+IF(D453=\"\",0,+D453)+IF(D455=\"\",0,+D455)","v":16},{"$f":"L452-M452","v":-14},{"$f":"I452*3+K452","v":3},null,"Nikos Haratsis (GRE)",3,2,1,0,20,8,12,6]
[{"$f":"$C52","v":"Jody Henrioul (BEL)"},{"$f":"IF('Séries individuels'!D181=\"\",\"\",'Séries individuels'!D181)","v":1},"-",{"$f":"IF('Séries individuels'!F181=\"\",\"\",'Séries individuels'!F181)","v":11},{"$f":"$E52","v":"Nikos Haratsis (GRE)"},null,{"$f":"A451","v":"Connor Bowden (ENG)"},{"$f":"IF(B451=\"\",0,1)+IF(D452=\"\",0,1)+IF(D455=\"\",0,1)","v":3},{"$f":"IF(B451>D451,1,0)+IF(D452>B452,1,0)+IF(D455>B455,1,0)","v":0},{"$f":"IF(B451<D451,1,0)+IF(D452<B452,1,0)+IF(D455<B455,1,0)","v":3},{"$f":"IF(B451=\"\",0,IF(B451=D451,1,0))+IF(B452=\"\",0,IF(B452=D452,1,0))+IF(B455=\"\",0,IF(B455=D455,1,0))","v":0},{"$f":"IF(B451=\"\",0,+B451)+IF(D452=\"\",0,+D452)+IF(D455=\"\",0,+D455)","v":0},{"$f":"IF(D451=\"\",0,+D451)+IF(B452=\"\",0,+B452)+IF(B455=\"\",0,+B455)","v":8},{"$f":"L453-M453","v":-8},{"$f":"I453*3+K453","v":0},null,"Jody Henrioul (BEL)",3,1,2,0,2,16,-14,3]
[{"$f":"$E52","v":"Nikos Haratsis (GRE)"},{"$f":"IF('Séries individuels'!D318=\"\",\"\",'Séries individuels'!D318)","v":4},"-",{"$f":"IF('Séries individuels'!F318=\"\",\"\",'Séries individuels'!F318)","v":7},{"$f":"$B52","v":"Florian Giaux (BEL)"},null,{"$f":"E451","v":"Nikos Haratsis (GRE)"},{"$f":"IF(D451=\"\",0,1)+IF(D453=\"\",0,1)+IF(B454=\"\",0,1)","v":3},{"$f":"IF(D451>B451,1,0)+IF(D453>B453,1,0)+IF(B454>D454,1,0)","v":2},{"$f":"IF(D451<B451,1,0)+IF(D453<B453,1,0)+IF(B454<D454,1,0)","v":1},{"$f":"IF(B451=\"\",0,IF(B451=D451,1,0))+IF(B453=\"\",0,IF(B453=D453,1,0))+IF(B454=\"\",0,IF(B454=D454,1,0))","v":0},{"$f":"IF(D451=\"\",0,+D451)+IF(D453=\"\",0,+D453)+IF(B454=\"\",0,+B454)","v":20},{"$f":"IF(B451=\"\",0,+B451)+IF(B453=\"\",0,+B453)+IF(D454=\"\",0,+D454)","v":8},{"$f":"L454-M454","v":12},{"$f":"I454*3+K454","v":6},null,"Connor Bowden (ENG)",3,0,3,0,0,8,-8,0]
[{"$f":"$C52","v":"Jody Henrioul (BEL)"},{"$f":"IF('Séries individuels'!D319=\"\",\"\",'Séries individuels'!D319)","v":1},"-",{"$f":"IF('Séries individuels'!F319=\"\",\"\",'Séries individuels'!F319)","v":0},{"$f":"$D52","v":"Connor Bowden (ENG)"},null,null,null,{"$f":"SUM(I451:I454)","v":6},{"$f":"SUM(J451:J454)","v":6},{"$f":"SUM(K451:K454)","v":0},{"$f":"SUM(L451:L454)","v":36},{"$f":"SUM(M451:M454)","v":36},{"$f":"SUM(N451:N454)","v":0}]
[]
["Group 2"]
[]
[{"$f":"$B53","v":"David González (ESP)"},{"$f":"IF('Séries individuels'!D48=\"\",\"\",'Séries individuels'!D48)","v":3},"-",{"$f":"IF('Séries individuels'!F48=\"\",\"\",'Séries individuels'!F48)","v":1},{"$f":"$C53","v":"Nathan Dizier (BEL)"},null,null,"P","W","L","N","+","-","d","PTS",null,null,"P","W","L","N","+","-","d","PTS"]
[{"$f":"$D53","v":"Koshiro Shibata (JPN)"},{"$f":"IF('Séries individuels'!D49=\"\",\"\",'Séries individuels'!D49)","v":0},"-",{"$f":"IF('Séries individuels'!F49=\"\",\"\",'Séries individuels'!F49)","v":5},{"$f":"$E53","v":"Marco Di Vito (ITA)"},null,{"$f":"A459","v":"David González (ESP)"},{"$f":"IF(B459=\"\",0,1)+IF(B461=\"\",0,1)+IF(D463=\"\",0,1)","v":3},{"$f":"IF(B459>D459,1,0)+IF(B461>D461,1,0)+IF(D463>B463,1,0)","v":2},{"$f":"IF(B459<D459,1,0)+IF(B461<D461,1,0)+IF(D463<B463,1,0)","v":1},{"$f":"IF(B459=\"\",0,IF(B459=D459,1,0))+IF(B461=\"\",0,IF(B461=D461,1,0))+IF(B463=\"\",0,IF(B463=D463,1,0))","v":0},{"$f":"IF(B459=\"\",0,+B459)+IF(B461=\"\",0,+B461)+IF(D463=\"\",0,+D463)","v":12},{"$f":"IF(D459=\"\",0,+D459)+IF(D461=\"\",0,+D461)+IF(B463=\"\",0,+B463)","v":14},{"$f":"L460-M460","v":-2},{"$f":"I460*3+K460","v":6},null,"Marco Di Vito (ITA)",3,3,0,0,22,2,20,9]
[{"$f":"$B53","v":"David González (ESP)"},{"$f":"IF('Séries individuels'!D182=\"\",\"\",'Séries individuels'!D182)","v":7},"-",{"$f":"IF('Séries individuels'!F182=\"\",\"\",'Séries individuels'!F182)","v":0},{"$f":"$D53","v":"Koshiro Shibata (JPN)"},null,{"$f":"E459","v":"Nathan Dizier (BEL)"},{"$f":"IF(D459=\"\",0,1)+IF(B462=\"\",0,1)+IF(B464=\"\",0,1)","v":3},{"$f":"IF(D459>B459,1,0)+IF(B462>D462,1,0)+IF(B464>D464,1,0)","v":1},{"$f":"IF(D459<B459,1,0)+IF(B462<D462,1,0)+IF(B464<D464,1,0)","v":2},{"$f":"IF(B459=\"\",0,IF(B459=D459,1,0))+IF(B462=\"\",0,IF(B462=D462,1,0))+IF(B464=\"\",0,IF(B464=D464,1,0))","v":0},{"$f":"IF(D459=\"\",0,+D459)+IF(B462=\"\",0,+B462)+IF(B464=\"\",0,+B464)","v":7},{"$f":"IF(B459=\"\",0,+B459)+IF(D462=\"\",0,+D462)+IF(D464=\"\",0,+D464)","v":7},{"$f":"L461-M461","v":0},{"$f":"I461*3+K461","v":3},null,"David González (ESP)",3,2,1,0,12,14,-2,6]
[{"$f":"$C53","v":"Nathan Dizier (BEL)"},{"$f":"IF('Séries individuels'!D183=\"\",\"\",'Séries individuels'!D183)","v":0},"-",{"$f":"IF('Séries individuels'!F183=\"\",\"\",'Séries individuels'!F183)","v":4},{"$f":"$E53","v":"Marco Di Vito (ITA)"},null,{"$f":"A460","v":"Koshiro Shibata (JPN)"},{"$f":"IF(B460=\"\",0,1)+IF(D461=\"\",0,1)+IF(D464=\"\",0,1)","v":3},{"$f":"IF(B460>D460,1,0)+IF(D461>B461,1,0)+IF(D464>B464,1,0)","v":0},{"$f":"IF(B460<D460,1,0)+IF(D461<B461,1,0)+IF(D464<B464,1,0)","v":3},{"$f":"IF(B460=\"\",0,IF(B460=D460,1,0))+IF(B461=\"\",0,IF(B461=D461,1,0))+IF(B464=\"\",0,IF(B464=D464,1,0))","v":0},{"$f":"IF(B460=\"\",0,+B460)+IF(D461=\"\",0,+D461)+IF(D464=\"\",0,+D464)","v":0},{"$f":"IF(D460=\"\",0,+D460)+IF(B461=\"\",0,+B461)+IF(B464=\"\",0,+B464)","v":18},{"$f":"L462-M462","v":-18},{"$f":"I462*3+K462","v":0},null,"Nathan Dizier (BEL)",3,1,2,0,7,7,0,3]
[{"$f":"$E53","v":"Marco Di Vito (ITA)"},{"$f":"IF('Séries individuels'!D320=\"\",\"\",'Séries individuels'!D320)","v":13},"-",{"$f":"IF('Séries individuels'!F320=\"\",\"\",'Séries individuels'!F320)","v":2},{"$f":"$B53","v":"David González (ESP)"},null,{"$f":"E460","v":"Marco Di Vito (ITA)"},{"$f":"IF(D460=\"\",0,1)+IF(D462=\"\",0,1)+IF(B463=\"\",0,1)","v":3},{"$f":"IF(D460>B460,1,0)+IF(D462>B462,1,0)+IF(B463>D463,1,0)","v":3},{"$f":"IF(D460<B460,1,0)+IF(D462<B462,1,0)+IF(B463<D463,1,0)","v":0},{"$f":"IF(B460=\"\",0,IF(B460=D460,1,0))+IF(B462=\"\",0,IF(B462=D462,1,0))+IF(B463=\"\",0,IF(B463=D463,1,0))","v":0},{"$f":"IF(D460=\"\",0,+D460)+IF(D462=\"\",0,+D462)+IF(B463=\"\",0,+B463)","v":22},{"$f":"IF(B460=\"\",0,+B460)+IF(B462=\"\",0,+B462)+IF(D463=\"\",0,+D463)","v":2},{"$f":"L463-M463","v":20},{"$f":"I463*3+K463","v":9},null,"Koshiro Shibata (JPN)",3,0,3,0,0,18,-18,0]
[{"$f":"$C53","v":"Nathan Dizier (BEL)"},{"$f":"IF('Séries individuels'!D321=\"\",\"\",'Séries individuels'!D321)","v":6},"-",{"$f":"IF('Séries individuels'!F321=\"\",\"\",'Séries individuels'!F321)","v":0},{"$f":"$D53","v":"Koshiro Shibata (JPN)"},null,null,null,{"$f":"SUM(I460:I463)","v":6},{"$f":"SUM(J460:J463)","v":6},{"$f":"SUM(K460:K463)","v":0},{"$f":"SUM(L460:L463)","v":41},{"$f":"SUM(M460:M463)","v":41},{"$f":"SUM(N460:N463)","v":0}]
[]
["Group 3"]
[]
[{"$f":"$B54","v":"Nicola Borgo (ITA)"},{"$f":"IF('Séries individuels'!D50=\"\",\"\",'Séries individuels'!D50)","v":5},"-",{"$f":"IF('Séries individuels'!F50=\"\",\"\",'Séries individuels'!F50)","v":0},{"$f":"$C54","v":"Christopher Bowen (ENG)"},null,null,"P","W","L","N","+","-","d","PTS",null,null,"P","W","L","N","+","-","d","PTS"]
[{"$f":"$D54","v":"Jesús Moreno (ESP)"},{"$f":"IF('Séries individuels'!D51=\"\",\"\",'Séries individuels'!D51)","v":0},"-",{"$f":"IF('Séries individuels'!F51=\"\",\"\",'Séries individuels'!F51)","v":3},{"$f":"$E54","v":"Martin Antoine (BEL)"},null,{"$f":"A468","v":"Nicola Borgo (ITA)"},{"$f":"IF(B468=\"\",0,1)+IF(B470=\"\",0,1)+IF(D472=\"\",0,1)","v":3},{"$f":"IF(B468>D468,1,0)+IF(B470>D470,1,0)+IF(D472>B472,1,0)","v":2},{"$f":"IF(B468<D468,1,0)+IF(B470<D470,1,0)+IF(D472<B472,1,0)","v":0},{"$f":"IF(B468=\"\",0,IF(B468=D468,1,0))+IF(B470=\"\",0,IF(B470=D470,1,0))+IF(B472=\"\",0,IF(B472=D472,1,0))","v":1},{"$f":"IF(B468=\"\",0,+B468)+IF(B470=\"\",0,+B470)+IF(D472=\"\",0,+D472)","v":11},{"$f":"IF(D468=\"\",0,+D468)+IF(D470=\"\",0,+D470)+IF(B472=\"\",0,+B472)","v":3},{"$f":"L469-M469","v":8},{"$f":"I469*3+K469","v":7},null,"Nicola Borgo (ITA)",3,2,0,1,11,3,8,7]
[{"$f":"$B54","v":"Nicola Borgo (ITA)"},{"$f":"IF('Séries individuels'!D245=\"\",\"\",'Séries individuels'!D245)","v":3},"-",{"$f":"IF('Séries individuels'!F245=\"\",\"\",'Séries individuels'!F245)","v":0},{"$f":"$D54","v":"Jesús Moreno (ESP)"},null,{"$f":"E468","v":"Christopher Bowen (ENG)"},{"$f":"IF(D468=\"\",0,1)+IF(B471=\"\",0,1)+IF(B473=\"\",0,1)","v":3},{"$f":"IF(D468>B468,1,0)+IF(B471>D471,1,0)+IF(B473>D473,1,0)","v":1},{"$f":"IF(D468<B468,1,0)+IF(B471<D471,1,0)+IF(B473<D473,1,0)","v":2},{"$f":"IF(B468=\"\",0,IF(B468=D468,1,0))+IF(B471=\"\",0,IF(B471=D471,1,0))+IF(B473=\"\",0,IF(B473=D473,1,0))","v":0},{"$f":"IF(D468=\"\",0,+D468)+IF(B471=\"\",0,+B471)+IF(B473=\"\",0,+B473)","v":5},{"$f":"IF(B468=\"\",0,+B468)+IF(D471=\"\",0,+D471)+IF(D473=\"\",0,+D473)","v":11},{"$f":"L470-M470","v":-6},{"$f":"I470*3+K470","v":3},null,"Martin Antoine (BEL)",3,2,0,1,12,5,7,7]
[{"$f":"$C54","v":"Christopher Bowen (ENG)"},{"$f":"IF('Séries individuels'!D246=\"\",\"\",'Séries individuels'!D246)","v":2},"-",{"$f":"IF('Séries individuels'!F246=\"\",\"\",'Séries individuels'!F246)","v":6},{"$f":"$E54","v":"Martin Antoine (BEL)"},null,{"$f":"A469","v":"Jesús Moreno (ESP)"},{"$f":"IF(B469=\"\",0,1)+IF(D470=\"\",0,1)+IF(D473=\"\",0,1)","v":3},{"$f":"IF(B469>D469,1,0)+IF(D470>B470,1,0)+IF(D473>B473,1,0)","v":0},{"$f":"IF(B469<D469,1,0)+IF(D470<B470,1,0)+IF(D473<B473,1,0)","v":3},{"$f":"IF(B469=\"\",0,IF(B469=D469,1,0))+IF(B470=\"\",0,IF(B470=D470,1,0))+IF(B473=\"\",0,IF(B473=D473,1,0))","v":0},{"$f":"IF(B469=\"\",0,+B469)+IF(D470=\"\",0,+D470)+IF(D473=\"\",0,+D473)","v":0},{"$f":"IF(D469=\"\",0,+D469)+IF(B470=\"\",0,+B470)+IF(B473=\"\",0,+B473)","v":9},{"$f":"L471-M471","v":-9},{"$f":"I471*3+K471","v":0},null,"Christopher Bowen (ENG)",3,1,2,0,5,11,-6,3]
[{"$f":"$E54","v":"Martin Antoine (BEL)"},{"$f":"IF('Séries individuels'!D379=\"\",\"\",'Séries individuels'!D379)","v":3},"-",{"$f":"IF('Séries individuels'!F379=\"\",\"\",'Séries individuels'!F379)","v":3},{"$f":"$B54","v":"Nicola Borgo (ITA)"},null,{"$f":"E469","v":"Martin Antoine (BEL)"},{"$f":"IF(D469=\"\",0,1)+IF(D471=\"\",0,1)+IF(B472=\"\",0,1)","v":3},{"$f":"IF(D469>B469,1,0)+IF(D471>B471,1,0)+IF(B472>D472,1,0)","v":2},{"$f":"IF(D469<B469,1,0)+IF(D471<B471,1,0)+IF(B472<D472,1,0)","v":0},{"$f":"IF(B469=\"\",0,IF(B469=D469,1,0))+IF(B471=\"\",0,IF(B471=D471,1,0))+IF(B472=\"\",0,IF(B472=D472,1,0))","v":1},{"$f":"IF(D469=\"\",0,+D469)+IF(D471=\"\",0,+D471)+IF(B472=\"\",0,+B472)","v":12},{"$f":"IF(B469=\"\",0,+B469)+IF(B471=\"\",0,+B471)+IF(D472=\"\",0,+D472)","v":5},{"$f":"L472-M472","v":7},{"$f":"I472*3+K472","v":7},null,"Jesús Moreno (ESP)",3,0,3,0,0,9,-9,0]
[{"$f":"$C54","v":"Christopher Bowen (ENG)"},{"$f":"IF('Séries individuels'!D380=\"\",\"\",'Séries individuels'!D380)","v":3},"-",{"$f":"IF('Séries individuels'!F380=\"\",\"\",'Séries individuels'!F380)","v":0},{"$f":"$D54","v":"Jesús Moreno (ESP)"},null,null,null,{"$f":"SUM(I469:I472)","v":5},{"$f":"SUM(J469:J472)","v":5},{"$f":"SUM(K469:K472)","v":2},{"$f":"SUM(L469:L472)","v":28},{"$f":"SUM(M469:M472)","v":28},{"$f":"SUM(N469:N472)","v":0}]
[]
["Group 4"]
[]
[{"$f":"$B55","v":"Steffen Despretz (BEL)"},{"$f":"IF('Séries individuels'!D52=\"\",\"\",'Séries individuels'!D52)","v":2},"-",{"$f":"IF('Séries individuels'!F52=\"\",\"\",'Séries individuels'!F52)","v":5},{"$f":"$C55","v":"Andrea Ciccarelli (ITA)"},null,null,"P","W","L","N","+","-","d","PTS",null,null,"P","W","L","N","+","-","d","PTS"]
[{"$f":"$D55","v":"Nealmark Bonnici (MLT)"},{"$f":"IF('Séries individuels'!D53=\"\",\"\",'Séries individuels'!D53)","v":0},"-",{"$f":"IF('Séries individuels'!F53=\"\",\"\",'Séries individuels'!F53)","v":5},{"$f":"$E55","v":"Fabio Bianco (GER)"},null,{"$f":"A477","v":"Steffen Despretz (BEL)"},{"$f":"IF(B477=\"\",0,1)+IF(B479=\"\",0,1)+IF(D481=\"\",0,1)","v":3},{"$f":"IF(B477>D477,1,0)+IF(B479>D479,1,0)+IF(D481>B481,1,0)","v":2},{"$f":"IF(B477<D477,1,0)+IF(B479<D479,1,0)+IF(D481<B481,1,0)","v":1},{"$f":"IF(B477=\"\",0,IF(B477=D477,1,0))+IF(B479=\"\",0,IF(B479=D479,1,0))+IF(B481=\"\",0,IF(B481=D481,1,0))","v":0},{"$f":"IF(B477=\"\",0,+B477)+IF(B479=\"\",0,+B479)+IF(D481=\"\",0,+D481)","v":12},{"$f":"IF(D477=\"\",0,+D477)+IF(D479=\"\",0,+D479)+IF(B481=\"\",0,+B481)","v":5},{"$f":"L478-M478","v":7},{"$f":"I478*3+K478","v":6},null,"Andrea Ciccarelli (ITA)",3,3,0,0,14,4,10,9]
[{"$f":"$B55","v":"Steffen Despretz (BEL)"},{"$f":"IF('Séries individuels'!D247=\"\",\"\",'Séries individuels'!D247)","v":6},"-",{"$f":"IF('Séries individuels'!F247=\"\",\"\",'Séries individuels'!F247)","v":0},{"$f":"$D55","v":"Nealmark Bonnici (MLT)"},null,{"$f":"E477","v":"Andrea Ciccarelli (ITA)"},{"$f":"IF(D477=\"\",0,1)+IF(B480=\"\",0,1)+IF(B482=\"\",0,1)","v":3},{"$f":"IF(D477>B477,1,0)+IF(B480>D480,1,0)+IF(B482>D482,1,0)","v":3},{"$f":"IF(D477<B477,1,0)+IF(B480<D480,1,0)+IF(B482<D482,1,0)","v":0},{"$f":"IF(B477=\"\",0,IF(B477=D477,1,0))+IF(B480=\"\",0,IF(B480=D480,1,0))+IF(B482=\"\",0,IF(B482=D482,1,0))","v":0},{"$f":"IF(D477=\"\",0,+D477)+IF(B480=\"\",0,+B480)+IF(B482=\"\",0,+B482)","v":14},{"$f":"IF(B477=\"\",0,+B477)+IF(D480=\"\",0,+D480)+IF(D482=\"\",0,+D482)","v":4},{"$f":"L479-M479","v":10},{"$f":"I479*3+K479","v":9},null,"Steffen Despretz (BEL)",3,2,1,0,12,5,7,6]
[{"$f":"$C55","v":"Andrea Ciccarelli (ITA)"},{"$f":"IF('Séries individuels'!D248=\"\",\"\",'Séries individuels'!D248)","v":4},"-",{"$f":"IF('Séries individuels'!F248=\"\",\"\",'Séries individuels'!F248)","v":2},{"$f":"$E55","v":"Fabio Bianco (GER)"},null,{"$f":"A478","v":"Nealmark Bonnici (MLT)"},{"$f":"IF(B478=\"\",0,1)+IF(D479=\"\",0,1)+IF(D482=\"\",0,1)","v":3},{"$f":"IF(B478>D478,1,0)+IF(D479>B479,1,0)+IF(D482>B482,1,0)","v":0},{"$f":"IF(B478<D478,1,0)+IF(D479<B479,1,0)+IF(D482<B482,1,0)","v":3},{"$f":"IF(B478=\"\",0,IF(B478=D478,1,0))+IF(B479=\"\",0,IF(B479=D479,1,0))+IF(B482=\"\",0,IF(B482=D482,1,0))","v":0},{"$f":"IF(B478=\"\",0,+B478)+IF(D479=\"\",0,+D479)+IF(D482=\"\",0,+D482)","v":0},{"$f":"IF(D478=\"\",0,+D478)+IF(B479=\"\",0,+B479)+IF(B482=\"\",0,+B482)","v":16},{"$f":"L480-M480","v":-16},{"$f":"I480*3+K480","v":0},null,"Fabio Bianco (GER)",3,1,2,0,7,8,-1,3]
[{"$f":"$E55","v":"Fabio Bianco (GER)"},{"$f":"IF('Séries individuels'!D381=\"\",\"\",'Séries individuels'!D381)","v":0},"-",{"$f":"IF('Séries individuels'!F381=\"\",\"\",'Séries individuels'!F381)","v":4},{"$f":"$B55","v":"Steffen Despretz (BEL)"},null,{"$f":"E478","v":"Fabio Bianco (GER)"},{"$f":"IF(D478=\"\",0,1)+IF(D480=\"\",0,1)+IF(B481=\"\",0,1)","v":3},{"$f":"IF(D478>B478,1,0)+IF(D480>B480,1,0)+IF(B481>D481,1,0)","v":1},{"$f":"IF(D478<B478,1,0)+IF(D480<B480,1,0)+IF(B481<D481,1,0)","v":2},{"$f":"IF(B478=\"\",0,IF(B478=D478,1,0))+IF(B480=\"\",0,IF(B480=D480,1,0))+IF(B481=\"\",0,IF(B481=D481,1,0))","v":0},{"$f":"IF(D478=\"\",0,+D478)+IF(D480=\"\",0,+D480)+IF(B481=\"\",0,+B481)","v":7},{"$f":"IF(B478=\"\",0,+B478)+IF(B480=\"\",0,+B480)+IF(D481=\"\",0,+D481)","v":8},{"$f":"L481-M481","v":-1},{"$f":"I481*3+K481","v":3},null,"Nealmark Bonnici (MLT)",3,0,3,0,0,16,-16,0]
[{"$f":"$C55","v":"Andrea Ciccarelli (ITA)"},{"$f":"IF('Séries individuels'!D382=\"\",\"\",'Séries individuels'!D382)","v":5},"-",{"$f":"IF('Séries individuels'!F382=\"\",\"\",'Séries individuels'!F382)","v":0},{"$f":"$D55","v":"Nealmark Bonnici (MLT)"},null,null,null,{"$f":"SUM(I478:I481)","v":6},{"$f":"SUM(J478:J481)","v":6},{"$f":"SUM(K478:K481)","v":0},{"$f":"SUM(L478:L481)","v":33},{"$f":"SUM(M478:M481)","v":33},{"$f":"SUM(N478:N481)","v":0}]
[]
["Group 5"]
[]
[{"$f":"$B56","v":"Antonio Casin (ESP)"},{"$f":"IF('Séries individuels'!D111=\"\",\"\",'Séries individuels'!D111)","v":5},"-",{"$f":"IF('Séries individuels'!F111=\"\",\"\",'Séries individuels'!F111)","v":0},{"$f":"$C56","v":"Quentin Van Glabeke (BEL)"},null,null,"P","W","L","N","+","-","d","PTS",null,null,"P","W","L","N","+","-","d","PTS"]
[{"$f":"$D56","v":"Théo Modeste (FRA)"},{"$f":"IF('Séries individuels'!D112=\"\",\"\",'Séries individuels'!D112)","v":2},"-",{"$f":"IF('Séries individuels'!F112=\"\",\"\",'Séries individuels'!F112)","v":1},{"$f":"$E56","v":"Ricardo Jose (POR)"},null,{"$f":"A486","v":"Antonio Casin (ESP)"},{"$f":"IF(B486=\"\",0,1)+IF(B488=\"\",0,1)+IF(D490=\"\",0,1)","v":3},{"$f":"IF(B486>D486,1,0)+IF(B488>D488,1,0)+IF(D490>B490,1,0)","v":3},{"$f":"IF(B486<D486,1,0)+IF(B488<D488,1,0)+IF(D490<B490,1,0)","v":0},{"$f":"IF(B486=\"\",0,IF(B486=D486,1,0))+IF(B488=\"\",0,IF(B488=D488,1,0))+IF(B490=\"\",0,IF(B490=D490,1,0))","v":0},{"$f":"IF(B486=\"\",0,+B486)+IF(B488=\"\",0,+B488)+IF(D490=\"\",0,+D490)","v":18},{"$f":"IF(D486=\"\",0,+D486)+IF(D488=\"\",0,+D488)+IF(B490=\"\",0,+B490)","v":8},{"$f":"L487-M487","v":10},{"$f":"I487*3+K487","v":9},null,"Antonio Casin (ESP)",3,3,0,0,18,8,10,9]
[{"$f":"$B56","v":"Antonio Casin (ESP)"},{"$f":"IF('Séries individuels'!D249=\"\",\"\",'Séries individuels'!D249)","v":6},"-",{"$f":"IF('Séries individuels'!F249=\"\",\"\",'Séries individuels'!F249)","v":3},{"$f":"$D56","v":"Théo Modeste (FRA)"},null,{"$f":"E486","v":"Quentin Van Glabeke (BEL)"},{"$f":"IF(D486=\"\",0,1)+IF(B489=\"\",0,1)+IF(B491=\"\",0,1)","v":3},{"$f":"IF(D486>B486,1,0)+IF(B489>D489,1,0)+IF(B491>D491,1,0)","v":1},{"$f":"IF(D486<B486,1,0)+IF(B489<D489,1,0)+IF(B491<D491,1,0)","v":2},{"$f":"IF(B486=\"\",0,IF(B486=D486,1,0))+IF(B489=\"\",0,IF(B489=D489,1,0))+IF(B491=\"\",0,IF(B491=D491,1,0))","v":0},{"$f":"IF(D486=\"\",0,+D486)+IF(B489=\"\",0,+B489)+IF(B491=\"\",0,+B491)","v":3},{"$f":"IF(B486=\"\",0,+B486)+IF(D489=\"\",0,+D489)+IF(D491=\"\",0,+D491)","v":8},{"$f":"L488-M488","v":-5},{"$f":"I488*3+K488","v":3},null,"Théo Modeste (FRA)",3,2,1,0,8,9,-1,6]
[{"$f":"$C56","v":"Quentin Van Glabeke (BEL)"},{"$f":"IF('Séries individuels'!D250=\"\",\"\",'Séries individuels'!D250)","v":1},"-",{"$f":"IF('Séries individuels'!F250=\"\",\"\",'Séries individuels'!F250)","v":0},{"$f":"$E56","v":"Ricardo Jose (POR)"},null,{"$f":"A487","v":"Théo Modeste (FRA)"},{"$f":"IF(B487=\"\",0,1)+IF(D488=\"\",0,1)+IF(D491=\"\",0,1)","v":3},{"$f":"IF(B487>D487,1,0)+IF(D488>B488,1,0)+IF(D491>B491,1,0)","v":2},{"$f":"IF(B487<D487,1,0)+IF(D488<B488,1,0)+IF(D491<B491,1,0)","v":1},{"$f":"IF(B487=\"\",0,IF(B487=D487,1,0))+IF(B488=\"\",0,IF(B488=D488,1,0))+IF(B491=\"\",0,IF(B491=D491,1,0))","v":0},{"$f":"IF(B487=\"\",0,+B487)+IF(D488=\"\",0,+D488)+IF(D491=\"\",0,+D491)","v":8},{"$f":"IF(D487=\"\",0,+D487)+IF(B488=\"\",0,+B488)+IF(B491=\"\",0,+B491)","v":9},{"$f":"L489-M489","v":-1},{"$f":"I489*3+K489","v":6},null,"Quentin Van Glabeke (BEL)",3,1,2,0,3,8,-5,3]
[{"$f":"$E56","v":"Ricardo Jose (POR)"},{"$f":"IF('Séries individuels'!D446=\"\",\"\",'Séries individuels'!D446)","v":5},"-",{"$f":"IF('Séries individuels'!F446=\"\",\"\",'Séries individuels'!F446)","v":7},{"$f":"$B56","v":"Antonio Casin (ESP)"},null,{"$f":"E487","v":"Ricardo Jose (POR)"},{"$f":"IF(D487=\"\",0,1)+IF(D489=\"\",0,1)+IF(B490=\"\",0,1)","v":3},{"$f":"IF(D487>B487,1,0)+IF(D489>B489,1,0)+IF(B490>D490,1,0)","v":0},{"$f":"IF(D487<B487,1,0)+IF(D489<B489,1,0)+IF(B490<D490,1,0)","v":3},{"$f":"IF(B487=\"\",0,IF(B487=D487,1,0))+IF(B489=\"\",0,IF(B489=D489,1,0))+IF(B490=\"\",0,IF(B490=D490,1,0))","v":0},{"$f":"IF(D487=\"\",0,+D487)+IF(D489=\"\",0,+D489)+IF(B490=\"\",0,+B490)","v":6},{"$f":"IF(B487=\"\",0,+B487)+IF(B489=\"\",0,+B489)+IF(D490=\"\",0,+D490)","v":10},{"$f":"L490-M490","v":-4},{"$f":"I490*3+K490","v":0},null,"Ricardo Jose (POR)",3,0,3,0,6,10,-4,0]
[{"$f":"$C56","v":"Quentin Van Glabeke (BEL)"},{"$f":"IF('Séries individuels'!D447=\"\",\"\",'Séries individuels'!D447)","v":2},"-",{"$f":"IF('Séries individuels'!F447=\"\",\"\",'Séries individuels'!F447)","v":3},{"$f":"$D56","v":"Théo Modeste (FRA)"},null,null,null,{"$f":"SUM(I487:I490)","v":6},{"$f":"SUM(J487:J490)","v":6},{"$f":"SUM(K487:K490)","v":0},{"$f":"SUM(L487:L490)","v":35},{"$f":"SUM(M487:M490)","v":35},{"$f":"SUM(N487:N490)","v":0}]
[]
["Group 6"]
[]
[{"$f":"$B57","v":"Raphaël Pommier (FRA)"},{"$f":"IF('Séries individuels'!D113=\"\",\"\",'Séries individuels'!D113)","v":3},"-",{"$f":"IF('Séries individuels'!F113=\"\",\"\",'Séries individuels'!F113)","v":1},{"$f":"$C57","v":"Corentin Wauthy (BEL)"},null,null,"P","W","L","N","+","-","d","PTS",null,null,"P","W","L","N","+","-","d","PTS"]
[{"$f":"$D57","v":"Afonso Pereira (POR)"},{"$f":"IF('Séries individuels'!D114=\"\",\"\",'Séries individuels'!D114)","v":2},"-",{"$f":"IF('Séries individuels'!F114=\"\",\"\",'Séries individuels'!F114)","v":2},{"$f":"$E57","v":"Paolo Zambello (ITA)"},null,{"$f":"A495","v":"Raphaël Pommier (FRA)"},{"$f":"IF(B495=\"\",0,1)+IF(B497=\"\",0,1)+IF(D499=\"\",0,1)","v":3},{"$f":"IF(B495>D495,1,0)+IF(B497>D497,1,0)+IF(D499>B499,1,0)","v":1},{"$f":"IF(B495<D495,1,0)+IF(B497<D497,1,0)+IF(D499<B499,1,0)","v":1},{"$f":"IF(B495=\"\",0,IF(B495=D495,1,0))+IF(B497=\"\",0,IF(B497=D497,1,0))+IF(B499=\"\",0,IF(B499=D499,1,0))","v":1},{"$f":"IF(B495=\"\",0,+B495)+IF(B497=\"\",0,+B497)+IF(D499=\"\",0,+D499)","v":7},{"$f":"IF(D495=\"\",0,+D495)+IF(D497=\"\",0,+D497)+IF(B499=\"\",0,+B499)","v":8},{"$f":"L496-M496","v":-1},{"$f":"I496*3+K496","v":4},null,"Paolo Zambello (ITA)",3,2,0,1,14,8,6,7]
[{"$f":"$B57","v":"Raphaël Pommier (FRA)"},{"$f":"IF('Séries individuels'!D251=\"\",\"\",'Séries individuels'!D251)","v":1},"-",{"$f":"IF('Séries individuels'!F251=\"\",\"\",'Séries individuels'!F251)","v":1},{"$f":"$D57","v":"Afonso Pereira (POR)"},null,{"$f":"E495","v":"Corentin Wauthy (BEL)"},{"$f":"IF(D495=\"\",0,1)+IF(B498=\"\",0,1)+IF(B500=\"\",0,1)","v":3},{"$f":"IF(D495>B495,1,0)+IF(B498>D498,1,0)+IF(B500>D500,1,0)","v":0},{"$f":"IF(D495<B495,1,0)+IF(B498<D498,1,0)+IF(B500<D500,1,0)","v":3},{"$f":"IF(B495=\"\",0,IF(B495=D495,1,0))+IF(B498=\"\",0,IF(B498=D498,1,0))+IF(B500=\"\",0,IF(B500=D500,1,0))","v":0},{"$f":"IF(D495=\"\",0,+D495)+IF(B498=\"\",0,+B498)+IF(B500=\"\",0,+B500)","v":6},{"$f":"IF(B495=\"\",0,+B495)+IF(D498=\"\",0,+D498)+IF(D500=\"\",0,+D500)","v":15},{"$f":"L497-M497","v":-9},{"$f":"I497*3+K497","v":0},null,"Afonso Pereira (POR)",3,1,0,2,9,5,4,5]
[{"$f":"$C57","v":"Corentin Wauthy (BEL)"},{"$f":"IF('Séries individuels'!D252=\"\",\"\",'Séries individuels'!D252)","v":3},"-",{"$f":"IF('Séries individuels'!F252=\"\",\"\",'Séries individuels'!F252)","v":6},{"$f":"$E57","v":"Paolo Zambello (ITA)"},null,{"$f":"A496","v":"Afonso Pereira (POR)"},{"$f":"IF(B496=\"\",0,1)+IF(D497=\"\",0,1)+IF(D500=\"\",0,1)","v":3},{"$f":"IF(B496>D496,1,0)+IF(D497>B497,1,0)+IF(D500>B500,1,0)","v":1},{"$f":"IF(B496<D496,1,0)+IF(D497<B497,1,0)+IF(D500<B500,1,0)","v":0},{"$f":"IF(B496=\"\",0,IF(B496=D496,1,0))+IF(B497=\"\",0,IF(B497=D497,1,0))+IF(B500=\"\",0,IF(B500=D500,1,0))","v":2},{"$f":"IF(B496=\"\",0,+B496)+IF(D497=\"\",0,+D497)+IF(D500=\"\",0,+D500)","v":9},{"$f":"IF(D496=\"\",0,+D496)+IF(B497=\"\",0,+B497)+IF(B500=\"\",0,+B500)","v":5},{"$f":"L498-M498","v":4},{"$f":"I498*3+K498","v":5},null,"Raphaël Pommier (FRA)",3,1,1,1,7,8,-1,4]
[{"$f":"$E57","v":"Paolo Zambello (ITA)"},{"$f":"IF('Séries individuels'!D448=\"\",\"\",'Séries individuels'!D448)","v":6},"-",{"$f":"IF('Séries individuels'!F448=\"\",\"\",'Séries individuels'!F448)","v":3},{"$f":"$B57","v":"Raphaël Pommier (FRA)"},null,{"$f":"E496","v":"Paolo Zambello (ITA)"},{"$f":"IF(D496=\"\",0,1)+IF(D498=\"\",0,1)+IF(B499=\"\",0,1)","v":3},{"$f":"IF(D496>B496,1,0)+IF(D498>B498,1,0)+IF(B499>D499,1,0)","v":2},{"$f":"IF(D496<B496,1,0)+IF(D498<B498,1,0)+IF(B499<D499,1,0)","v":0},{"$f":"IF(B496=\"\",0,IF(B496=D496,1,0))+IF(B498=\"\",0,IF(B498=D498,1,0))+IF(B499=\"\",0,IF(B499=D499,1,0))","v":1},{"$f":"IF(D496=\"\",0,+D496)+IF(D498=\"\",0,+D498)+IF(B499=\"\",0,+B499)","v":14},{"$f":"IF(B496=\"\",0,+B496)+IF(B498=\"\",0,+B498)+IF(D499=\"\",0,+D499)","v":8},{"$f":"L499-M499","v":6},{"$f":"I499*3+K499","v":7},null,"Corentin Wauthy (BEL)",3,0,3,0,6,15,-9,0]
[{"$f":"$C57","v":"Corentin Wauthy (BEL)"},{"$f":"IF('Séries individuels'!D449=\"\",\"\",'Séries individuels'!D449)","v":2},"-",{"$f":"IF('Séries individuels'!F449=\"\",\"\",'Séries individuels'!F449)","v":6},{"$f":"$D57","v":"Afonso Pereira (POR)"},null,null,null,{"$f":"SUM(I496:I499)","v":4},{"$f":"SUM(J496:J499)","v":4},{"$f":"SUM(K496:K499)","v":4},{"$f":"SUM(L496:L499)","v":36},{"$f":"SUM(M496:M499)","v":36},{"$f":"SUM(N496:N499)","v":0}]
[]
["Group 7"]
[]
[{"$f":"$B58","v":"Elliott Bellefontaine (ENG)"},{"$f":"IF('Séries individuels'!D115=\"\",\"\",'Séries individuels'!D115)","v":1},"-",{"$f":"IF('Séries individuels'!F115=\"\",\"\",'Séries individuels'!F115)","v":3},{"$f":"$C58","v":"William Van den Houte (BEL)"},null,null,"P","W","L","N","+","-","d","PTS",null,null,"P","W","L","N","+","-","d","PTS"]
[{"$f":"$D58","v":"Claudio Panebianco (ITA)"},{"$f":"IF('Séries individuels'!D116=\"\",\"\",'Séries individuels'!D116)","v":4},"-",{"$f":"IF('Séries individuels'!F116=\"\",\"\",'Séries individuels'!F116)","v":2},{"$f":"$E58","v":"Arnaud Le Téno (FRA)"},null,{"$f":"A504","v":"Elliott Bellefontaine (ENG)"},{"$f":"IF(B504=\"\",0,1)+IF(B506=\"\",0,1)+IF(D508=\"\",0,1)","v":3},{"$f":"IF(B504>D504,1,0)+IF(B506>D506,1,0)+IF(D508>B508,1,0)","v":0},{"$f":"IF(B504<D504,1,0)+IF(B506<D506,1,0)+IF(D508<B508,1,0)","v":3},{"$f":"IF(B504=\"\",0,IF(B504=D504,1,0))+IF(B506=\"\",0,IF(B506=D506,1,0))+IF(B508=\"\",0,IF(B508=D508,1,0))","v":0},{"$f":"IF(B504=\"\",0,+B504)+IF(B506=\"\",0,+B506)+IF(D508=\"\",0,+D508)","v":6},{"$f":"IF(D504=\"\",0,+D504)+IF(D506=\"\",0,+D506)+IF(B508=\"\",0,+B508)","v":15},{"$f":"L505-M505","v":-9},{"$f":"I505*3+K505","v":0},null,"Claudio Panebianco (ITA)",3,3,0,0,17,6,11,9]
[{"$f":"$B58","v":"Elliott Bellefontaine (ENG)"},{"$f":"IF('Séries individuels'!D314=\"\",\"\",'Séries individuels'!D314)","v":3},"-",{"$f":"IF('Séries individuels'!F314=\"\",\"\",'Séries individuels'!F314)","v":8},{"$f":"$D58","v":"Claudio Panebianco (ITA)"},null,{"$f":"E504","v":"William Van den Houte (BEL)"},{"$f":"IF(D504=\"\",0,1)+IF(B507=\"\",0,1)+IF(B509=\"\",0,1)","v":3},{"$f":"IF(D504>B504,1,0)+IF(B507>D507,1,0)+IF(B509>D509,1,0)","v":2},{"$f":"IF(D504<B504,1,0)+IF(B507<D507,1,0)+IF(B509<D509,1,0)","v":1},{"$f":"IF(B504=\"\",0,IF(B504=D504,1,0))+IF(B507=\"\",0,IF(B507=D507,1,0))+IF(B509=\"\",0,IF(B509=D509,1,0))","v":0},{"$f":"IF(D504=\"\",0,+D504)+IF(B507=\"\",0,+B507)+IF(B509=\"\",0,+B509)","v":12},{"$f":"IF(B504=\"\",0,+B504)+IF(D507=\"\",0,+D507)+IF(D509=\"\",0,+D509)","v":10},{"$f":"L506-M506","v":2},{"$f":"I506*3+K506","v":6},null,"William Van den Houte (BEL)",3,2,1,0,12,10,2,6]
[{"$f":"$C58","v":"William Van den Houte (BEL)"},{"$f":"IF('Séries individuels'!D315=\"\",\"\",'Séries individuels'!D315)","v":8},"-",{"$f":"IF('Séries individuels'!F315=\"\",\"\",'Séries individuels'!F315)","v":4},{"$f":"$E58","v":"Arnaud Le Téno (FRA)"},null,{"$f":"A505","v":"Claudio Panebianco (ITA)"},{"$f":"IF(B505=\"\",0,1)+IF(D506=\"\",0,1)+IF(D509=\"\",0,1)","v":3},{"$f":"IF(B505>D505,1,0)+IF(D506>B506,1,0)+IF(D509>B509,1,0)","v":3},{"$f":"IF(B505<D505,1,0)+IF(D506<B506,1,0)+IF(D509<B509,1,0)","v":0},{"$f":"IF(B505=\"\",0,IF(B505=D505,1,0))+IF(B506=\"\",0,IF(B506=D506,1,0))+IF(B509=\"\",0,IF(B509=D509,1,0))","v":0},{"$f":"IF(B505=\"\",0,+B505)+IF(D506=\"\",0,+D506)+IF(D509=\"\",0,+D509)","v":17},{"$f":"IF(D505=\"\",0,+D505)+IF(B506=\"\",0,+B506)+IF(B509=\"\",0,+B509)","v":6},{"$f":"L507-M507","v":11},{"$f":"I507*3+K507","v":9},null,"Arnaud Le Téno (FRA)",3,1,2,0,10,14,-4,3]
[{"$f":"$E58","v":"Arnaud Le Téno (FRA)"},{"$f":"IF('Séries individuels'!D450=\"\",\"\",'Séries individuels'!D450)","v":4},"-",{"$f":"IF('Séries individuels'!F450=\"\",\"\",'Séries individuels'!F450)","v":2},{"$f":"$B58","v":"Elliott Bellefontaine (ENG)"},null,{"$f":"E505","v":"Arnaud Le Téno (FRA)"},{"$f":"IF(D505=\"\",0,1)+IF(D507=\"\",0,1)+IF(B508=\"\",0,1)","v":3},{"$f":"IF(D505>B505,1,0)+IF(D507>B507,1,0)+IF(B508>D508,1,0)","v":1},{"$f":"IF(D505<B505,1,0)+IF(D507<B507,1,0)+IF(B508<D508,1,0)","v":2},{"$f":"IF(B505=\"\",0,IF(B505=D505,1,0))+IF(B507=\"\",0,IF(B507=D507,1,0))+IF(B508=\"\",0,IF(B508=D508,1,0))","v":0},{"$f":"IF(D505=\"\",0,+D505)+IF(D507=\"\",0,+D507)+IF(B508=\"\",0,+B508)","v":10},{"$f":"IF(B505=\"\",0,+B505)+IF(B507=\"\",0,+B507)+IF(D508=\"\",0,+D508)","v":14},{"$f":"L508-M508","v":-4},{"$f":"I508*3+K508","v":3},null,"Elliott Bellefontaine (ENG)",3,0,3,0,6,15,-9,0]
[{"$f":"$C58","v":"William Van den Houte (BEL)"},{"$f":"IF('Séries individuels'!D451=\"\",\"\",'Séries individuels'!D451)","v":1},"-",{"$f":"IF('Séries individuels'!F451=\"\",\"\",'Séries individuels'!F451)","v":5},{"$f":"$D58","v":"Claudio Panebianco (ITA)"},null,null,null,{"$f":"SUM(I505:I508)","v":6},{"$f":"SUM(J505:J508)","v":6},{"$f":"SUM(K505:K508)","v":0},{"$f":"SUM(L505:L508)","v":45},{"$f":"SUM(M505:M508)","v":45},{"$f":"SUM(N505:N508)","v":0}]
[]
["Group 8"]
[]
[{"$f":"$B59","v":"Matteo Ciccarelli (ITA)"},{"$f":"IF('Séries individuels'!D117=\"\",\"\",'Séries individuels'!D117)","v":2},"-",{"$f":"IF('Séries individuels'!F117=\"\",\"\",'Séries individuels'!F117)","v":1},{"$f":"$C59","v":"Kai Hagenkötter (GER)"},null,null,"P","W","L","N","+","-","d","PTS",null,null,"P","W","L","N","+","-","d","PTS"]
[{"$f":"$D59","v":"Maxime Muraille (BEL)"},{"$f":"IF('Séries individuels'!D118=\"\",\"\",'Séries individuels'!D118)","v":2},"-",{"$f":"IF('Séries individuels'!F118=\"\",\"\",'Séries individuels'!F118)","v":1},{"$f":"$E59","v":"Paul Naszalyi (FRA)"},null,{"$f":"A513","v":"Matteo Ciccarelli (ITA)"},{"$f":"IF(B513=\"\",0,1)+IF(B515=\"\",0,1)+IF(D517=\"\",0,1)","v":3},{"$f":"IF(B513>D513,1,0)+IF(B515>D515,1,0)+IF(D517>B517,1,0)","v":2},{"$f":"IF(B513<D513,1,0)+IF(B515<D515,1,0)+IF(D517<B517,1,0)","v":0},{"$f":"IF(B513=\"\",0,IF(B513=D513,1,0))+IF(B515=\"\",0,IF(B515=D515,1,0))+IF(B517=\"\",0,IF(B517=D517,1,0))","v":1},{"$f":"IF(B513=\"\",0,+B513)+IF(B515=\"\",0,+B515)+IF(D517=\"\",0,+D517)","v":10},{"$f":"IF(D513=\"\",0,+D513)+IF(D515=\"\",0,+D515)+IF(B517=\"\",0,+B517)","v":2},{"$f":"L514-M514","v":8},{"$f":"I514*3+K514","v":7},null,"Matteo Ciccarelli (ITA)",3,2,0,1,10,2,8,7]
[{"$f":"$B59","v":"Matteo Ciccarelli (ITA)"},{"$f":"IF('Séries individuels'!D316=\"\",\"\",'Séries individuels'!D316)","v":0},"-",{"$f":"IF('Séries individuels'!F316=\"\",\"\",'Séries individuels'!F316)","v":0},{"$f":"$D59","v":"Maxime Muraille (BEL)"},null,{"$f":"E513","v":"Kai Hagenkötter (GER)"},{"$f":"IF(D513=\"\",0,1)+IF(B516=\"\",0,1)+IF(B518=\"\",0,1)","v":3},{"$f":"IF(D513>B513,1,0)+IF(B516>D516,1,0)+IF(B518>D518,1,0)","v":2},{"$f":"IF(D513<B513,1,0)+IF(B516<D516,1,0)+IF(B518<D518,1,0)","v":1},{"$f":"IF(B513=\"\",0,IF(B513=D513,1,0))+IF(B516=\"\",0,IF(B516=D516,1,0))+IF(B518=\"\",0,IF(B518=D518,1,0))","v":0},{"$f":"IF(D513=\"\",0,+D513)+IF(B516=\"\",0,+B516)+IF(B518=\"\",0,+B518)","v":8},{"$f":"IF(B513=\"\",0,+B513)+IF(D516=\"\",0,+D516)+IF(D518=\"\",0,+D518)","v":4},{"$f":"L515-M515","v":4},{"$f":"I515*3+K515","v":6},null,"Kai Hagenkötter (GER)",3,2,1,0,8,4,4,6]
[{"$f":"$C59","v":"Kai Hagenkötter (GER)"},{"$f":"IF('Séries individuels'!D317=\"\",\"\",'Séries individuels'!D317)","v":4},"-",{"$f":"IF('Séries individuels'!F317=\"\",\"\",'Séries individuels'!F317)","v":0},{"$f":"$E59","v":"Paul Naszalyi (FRA)"},null,{"$f":"A514","v":"Maxime Muraille (BEL)"},{"$f":"IF(B514=\"\",0,1)+IF(D515=\"\",0,1)+IF(D518=\"\",0,1)","v":3},{"$f":"IF(B514>D514,1,0)+IF(D515>B515,1,0)+IF(D518>B518,1,0)","v":1},{"$f":"IF(B514<D514,1,0)+IF(D515<B515,1,0)+IF(D518<B518,1,0)","v":1},{"$f":"IF(B514=\"\",0,IF(B514=D514,1,0))+IF(B515=\"\",0,IF(B515=D515,1,0))+IF(B518=\"\",0,IF(B518=D518,1,0))","v":1},{"$f":"IF(B514=\"\",0,+B514)+IF(D515=\"\",0,+D515)+IF(D518=\"\",0,+D518)","v":4},{"$f":"IF(D514=\"\",0,+D514)+IF(B515=\"\",0,+B515)+IF(B518=\"\",0,+B518)","v":4},{"$f":"L516-M516","v":0},{"$f":"I516*3+K516","v":4},null,"Maxime Muraille (BEL)",3,1,1,1,4,4,0,4]
[{"$f":"$E59","v":"Paul Naszalyi (FRA)"},{"$f":"IF('Séries individuels'!D452=\"\",\"\",'Séries individuels'!D452)","v":1},"-",{"$f":"IF('Séries individuels'!F452=\"\",\"\",'Séries individuels'!F452)","v":8},{"$f":"$B59","v":"Matteo Ciccarelli (ITA)"},null,{"$f":"E514","v":"Paul Naszalyi (FRA)"},{"$f":"IF(D514=\"\",0,1)+IF(D516=\"\",0,1)+IF(B517=\"\",0,1)","v":3},{"$f":"IF(D514>B514,1,0)+IF(D516>B516,1,0)+IF(B517>D517,1,0)","v":0},{"$f":"IF(D514<B514,1,0)+IF(D516<B516,1,0)+IF(B517<D517,1,0)","v":3},{"$f":"IF(B514=\"\",0,IF(B514=D514,1,0))+IF(B516=\"\",0,IF(B516=D516,1,0))+IF(B517=\"\",0,IF(B517=D517,1,0))","v":0},{"$f":"IF(D514=\"\",0,+D514)+IF(D516=\"\",0,+D516)+IF(B517=\"\",0,+B517)","v":2},{"$f":"IF(B514=\"\",0,+B514)+IF(B516=\"\",0,+B516)+IF(D517=\"\",0,+D517)","v":14},{"$f":"L517-M517","v":-12},{"$f":"I517*3+K517","v":0},null,"Paul Naszalyi (FRA)",3,0,3,0,2,14,-12,0]
[{"$f":"$C59","v":"Kai Hagenkötter (GER)"},{"$f":"IF('Séries individuels'!D453=\"\",\"\",'Séries individuels'!D453)","v":3},"-",{"$f":"IF('Séries individuels'!F453=\"\",\"\",'Séries individuels'!F453)","v":2},{"$f":"$D59","v":"Maxime Muraille (BEL)"},null,null,null,{"$f":"SUM(I514:I517)","v":5},{"$f":"SUM(J514:J517)","v":5},{"$f":"SUM(K514:K517)","v":2},{"$f":"SUM(L514:L517)","v":24},{"$f":"SUM(M514:M517)","v":24},{"$f":"SUM(N514:N517)","v":0}]
[]
[]
["U15 category"]
[]
["Group 1"]
[]
[{"$f":"$B63","v":"Maxime Rairoux (BEL)"},{"$f":"IF('Séries individuels'!D54=\"\",\"\",'Séries individuels'!D54)","v":5},"-",{"$f":"IF('Séries individuels'!F54=\"\",\"\",'Séries individuels'!F54)","v":0},{"$f":"$C63","v":"Florentine Ausset (FRA)"},null,null,"P","W","L","N","+","-","d","PTS",null,null,"P","W","L","N","+","-","d","PTS"]
[{"$f":"$D63","v":"Riccardo Lazzari (ITA)"},{"$f":"IF('Séries individuels'!D55=\"\",\"\",'Séries individuels'!D55)","v":0},"-",{"$f":"IF('Séries individuels'!F55=\"\",\"\",'Séries individuels'!F55)","v":0},{"$f":"$E63","v":"Adam Kraus (AUT)"},null,{"$f":"A525","v":"Maxime Rairoux (BEL)"},{"$f":"IF(B525=\"\",0,1)+IF(B527=\"\",0,1)+IF(D529=\"\",0,1)","v":3},{"$f":"IF(B525>D525,1,0)+IF(B527>D527,1,0)+IF(D529>B529,1,0)","v":3},{"$f":"IF(B525<D525,1,0)+IF(B527<D527,1,0)+IF(D529<B529,1,0)","v":0},{"$f":"IF(B525=\"\",0,IF(B525=D525,1,0))+IF(B527=\"\",0,IF(B527=D527,1,0))+IF(B529=\"\",0,IF(B529=D529,1,0))","v":0},{"$f":"IF(B525=\"\",0,+B525)+IF(B527=\"\",0,+B527)+IF(D529=\"\",0,+D529)","v":12},{"$f":"IF(D525=\"\",0,+D525)+IF(D527=\"\",0,+D527)+IF(B529=\"\",0,+B529)","v":0},{"$f":"L526-M526","v":12},{"$f":"I526*3+K526","v":9},null,"Maxime Rairoux (BEL)",3,3,0,0,12,0,12,9]
[{"$f":"$B63","v":"Maxime Rairoux (BEL)"},{"$f":"IF('Séries individuels'!D188=\"\",\"\",'Séries individuels'!D188)","v":2},"-",{"$f":"IF('Séries individuels'!F188=\"\",\"\",'Séries individuels'!F188)","v":0},{"$f":"$D63","v":"Riccardo Lazzari (ITA)"},null,{"$f":"E525","v":"Florentine Ausset (FRA)"},{"$f":"IF(D525=\"\",0,1)+IF(B528=\"\",0,1)+IF(B530=\"\",0,1)","v":3},{"$f":"IF(D525>B525,1,0)+IF(B528>D528,1,0)+IF(B530>D530,1,0)","v":1},{"$f":"IF(D525<B525,1,0)+IF(B528<D528,1,0)+IF(B530<D530,1,0)","v":2},{"$f":"IF(B525=\"\",0,IF(B525=D525,1,0))+IF(B528=\"\",0,IF(B528=D528,1,0))+IF(B530=\"\",0,IF(B530=D530,1,0))","v":0},{"$f":"IF(D525=\"\",0,+D525)+IF(B528=\"\",0,+B528)+IF(B530=\"\",0,+B530)","v":1},{"$f":"IF(B525=\"\",0,+B525)+IF(D528=\"\",0,+D528)+IF(D530=\"\",0,+D530)","v":10},{"$f":"L527-M527","v":-9},{"$f":"I527*3+K527","v":3},null,"Riccardo Lazzari (ITA)",3,1,1,1,5,2,3,4]
[{"$f":"$C63","v":"Florentine Ausset (FRA)"},{"$f":"IF('Séries individuels'!D189=\"\",\"\",'Séries individuels'!D189)","v":1},"-",{"$f":"IF('Séries individuels'!F189=\"\",\"\",'Séries individuels'!F189)","v":0},{"$f":"$E63","v":"Adam Kraus (AUT)"},null,{"$f":"A526","v":"Riccardo Lazzari (ITA)"},{"$f":"IF(B526=\"\",0,1)+IF(D527=\"\",0,1)+IF(D530=\"\",0,1)","v":3},{"$f":"IF(B526>D526,1,0)+IF(D527>B527,1,0)+IF(D530>B530,1,0)","v":1},{"$f":"IF(B526<D526,1,0)+IF(D527<B527,1,0)+IF(D530<B530,1,0)","v":1},{"$f":"IF(B526=\"\",0,IF(B526=D526,1,0))+IF(B527=\"\",0,IF(B527=D527,1,0))+IF(B530=\"\",0,IF(B530=D530,1,0))","v":1},{"$f":"IF(B526=\"\",0,+B526)+IF(D527=\"\",0,+D527)+IF(D530=\"\",0,+D530)","v":5},{"$f":"IF(D526=\"\",0,+D526)+IF(B527=\"\",0,+B527)+IF(B530=\"\",0,+B530)","v":2},{"$f":"L528-M528","v":3},{"$f":"I528*3+K528","v":4},null,"Florentine Ausset (FRA)",3,1,2,0,1,10,-9,3]
[{"$f":"$E63","v":"Adam Kraus (AUT)"},{"$f":"IF('Séries individuels'!D383=\"\",\"\",'Séries individuels'!D383)","v":0},"-",{"$f":"IF('Séries individuels'!F383=\"\",\"\",'Séries individuels'!F383)","v":5},{"$f":"$B63","v":"Maxime Rairoux (BEL)"},null,{"$f":"E526","v":"Adam Kraus (AUT)"},{"$f":"IF(D526=\"\",0,1)+IF(D528=\"\",0,1)+IF(B529=\"\",0,1)","v":3},{"$f":"IF(D526>B526,1,0)+IF(D528>B528,1,0)+IF(B529>D529,1,0)","v":0},{"$f":"IF(D526<B526,1,0)+IF(D528<B528,1,0)+IF(B529<D529,1,0)","v":2},{"$f":"IF(B526=\"\",0,IF(B526=D526,1,0))+IF(B528=\"\",0,IF(B528=D528,1,0))+IF(B529=\"\",0,IF(B529=D529,1,0))","v":1},{"$f":"IF(D526=\"\",0,+D526)+IF(D528=\"\",0,+D528)+IF(B529=\"\",0,+B529)","v":0},{"$f":"IF(B526=\"\",0,+B526)+IF(B528=\"\",0,+B528)+IF(D529=\"\",0,+D529)","v":6},{"$f":"L529-M529","v":-6},{"$f":"I529*3+K529","v":1},null,"Adam Kraus (AUT)",3,0,2,1,0,6,-6,1]
[{"$f":"$C63","v":"Florentine Ausset (FRA)"},{"$f":"IF('Séries individuels'!D384=\"\",\"\",'Séries individuels'!D384)","v":0},"-",{"$f":"IF('Séries individuels'!F384=\"\",\"\",'Séries individuels'!F384)","v":5},{"$f":"$D63","v":"Riccardo Lazzari (ITA)"},null,null,null,{"$f":"SUM(I526:I529)","v":5},{"$f":"SUM(J526:J529)","v":5},{"$f":"SUM(K526:K529)","v":2},{"$f":"SUM(L526:L529)","v":18},{"$f":"SUM(M526:M529)","v":18},{"$f":"SUM(N526:N529)","v":0}]
[]
["Group 2"]
[]
[{"$f":"$B64","v":"Marios Strommer (AUT)"},{"$f":"IF('Séries individuels'!D56=\"\",\"\",'Séries individuels'!D56)","v":4},"-",{"$f":"IF('Séries individuels'!F56=\"\",\"\",'Séries individuels'!F56)","v":5},{"$f":"$C64","v":"Andrea Bolognino (ITA)"},null,null,"P","W","L","N","+","-","d","PTS",null,null,"P","W","L","N","+","-","d","PTS"]
[{"$f":"$D64","v":"Vasco Henriques (POR)"},{"$f":"IF('Séries individuels'!D57=\"\",\"\",'Séries individuels'!D57)","v":4},"-",{"$f":"IF('Séries individuels'!F57=\"\",\"\",'Séries individuels'!F57)","v":0},{"$f":"$E64","v":"Manuel Politz (GER)"},null,{"$f":"A534","v":"Marios Strommer (AUT)"},{"$f":"IF(B534=\"\",0,1)+IF(B536=\"\",0,1)+IF(D538=\"\",0,1)","v":3},{"$f":"IF(B534>D534,1,0)+IF(B536>D536,1,0)+IF(D538>B538,1,0)","v":2},{"$f":"IF(B534<D534,1,0)+IF(B536<D536,1,0)+IF(D538<B538,1,0)","v":1},{"$f":"IF(B534=\"\",0,IF(B534=D534,1,0))+IF(B536=\"\",0,IF(B536=D536,1,0))+IF(B538=\"\",0,IF(B538=D538,1,0))","v":0},{"$f":"IF(B534=\"\",0,+B534)+IF(B536=\"\",0,+B536)+IF(D538=\"\",0,+D538)","v":14},{"$f":"IF(D534=\"\",0,+D534)+IF(D536=\"\",0,+D536)+IF(B538=\"\",0,+B538)","v":5},{"$f":"L535-M535","v":9},{"$f":"I535*3+K535","v":6},null,"Andrea Bolognino (ITA)",3,3,0,0,14,6,8,9]
[{"$f":"$B64","v":"Marios Strommer (AUT)"},{"$f":"IF('Séries individuels'!D190=\"\",\"\",'Séries individuels'!D190)","v":5},"-",{"$f":"IF('Séries individuels'!F190=\"\",\"\",'Séries individuels'!F190)","v":0},{"$f":"$D64","v":"Vasco Henriques (POR)"},null,{"$f":"E534","v":"Andrea Bolognino (ITA)"},{"$f":"IF(D534=\"\",0,1)+IF(B537=\"\",0,1)+IF(B539=\"\",0,1)","v":3},{"$f":"IF(D534>B534,1,0)+IF(B537>D537,1,0)+IF(B539>D539,1,0)","v":3},{"$f":"IF(D534<B534,1,0)+IF(B537<D537,1,0)+IF(B539<D539,1,0)","v":0},{"$f":"IF(B534=\"\",0,IF(B534=D534,1,0))+IF(B537=\"\",0,IF(B537=D537,1,0))+IF(B539=\"\",0,IF(B539=D539,1,0))","v":0},{"$f":"IF(D534=\"\",0,+D534)+IF(B537=\"\",0,+B537)+IF(B539=\"\",0,+B539)","v":14},{"$f":"IF(B534=\"\",0,+B534)+IF(D537=\"\",0,+D537)+IF(D539=\"\",0,+D539)","v":6},{"$f":"L536-M536","v":8},{"$f":"I536*3+K536","v":9},null,"Marios Strommer (AUT)",3,2,1,0,14,5,9,6]
[{"$f":"$C64","v":"Andrea Bolognino (ITA)"},{"$f":"IF('Séries individuels'!D191=\"\",\"\",'Séries individuels'!D191)","v":5},"-",{"$f":"IF('Séries individuels'!F191=\"\",\"\",'Séries individuels'!F191)","v":0},{"$f":"$E64","v":"Manuel Politz (GER)"},null,{"$f":"A535","v":"Vasco Henriques (POR)"},{"$f":"IF(B535=\"\",0,1)+IF(D536=\"\",0,1)+IF(D539=\"\",0,1)","v":3},{"$f":"IF(B535>D535,1,0)+IF(D536>B536,1,0)+IF(D539>B539,1,0)","v":1},{"$f":"IF(B535<D535,1,0)+IF(D536<B536,1,0)+IF(D539<B539,1,0)","v":2},{"$f":"IF(B535=\"\",0,IF(B535=D535,1,0))+IF(B536=\"\",0,IF(B536=D536,1,0))+IF(B539=\"\",0,IF(B539=D539,1,0))","v":0},{"$f":"IF(B535=\"\",0,+B535)+IF(D536=\"\",0,+D536)+IF(D539=\"\",0,+D539)","v":6},{"$f":"IF(D535=\"\",0,+D535)+IF(B536=\"\",0,+B536)+IF(B539=\"\",0,+B539)","v":9},{"$f":"L537-M537","v":-3},{"$f":"I537*3+K537","v":3},null,"Vasco Henriques (POR)",3,1,2,0,6,9,-3,3]
[{"$f":"$E64","v":"Manuel Politz (GER)"},{"$f":"IF('Séries individuels'!D385=\"\",\"\",'Séries individuels'!D385)","v":0},"-",{"$f":"IF('Séries individuels'!F385=\"\",\"\",'Séries individuels'!F385)","v":5},{"$f":"$B64","v":"Marios Strommer (AUT)"},null,{"$f":"E535","v":"Manuel Politz (GER)"},{"$f":"IF(D535=\"\",0,1)+IF(D537=\"\",0,1)+IF(B538=\"\",0,1)","v":3},{"$f":"IF(D535>B535,1,0)+IF(D537>B537,1,0)+IF(B538>D538,1,0)","v":0},{"$f":"IF(D535<B535,1,0)+IF(D537<B537,1,0)+IF(B538<D538,1,0)","v":3},{"$f":"IF(B535=\"\",0,IF(B535=D535,1,0))+IF(B537=\"\",0,IF(B537=D537,1,0))+IF(B538=\"\",0,IF(B538=D538,1,0))","v":0},{"$f":"IF(D535=\"\",0,+D535)+IF(D537=\"\",0,+D537)+IF(B538=\"\",0,+B538)","v":0},{"$f":"IF(B535=\"\",0,+B535)+IF(B537=\"\",0,+B537)+IF(D538=\"\",0,+D538)","v":14},{"$f":"L538-M538","v":-14},{"$f":"I538*3+K538","v":0},null,"Manuel Politz (GER)",3,0,3,0,0,14,-14,0]
[{"$f":"$C64","v":"Andrea Bolognino (ITA)"},{"$f":"IF('Séries individuels'!D386=\"\",\"\",'Séries individuels'!D386)","v":4},"-",{"$f":"IF('Séries individuels'!F386=\"\",\"\",'Séries individuels'!F386)","v":2},{"$f":"$D64","v":"Vasco Henriques (POR)"},null,null,null,{"$f":"SUM(I535:I538)","v":6},{"$f":"SUM(J535:J538)","v":6},{"$f":"SUM(K535:K538)","v":0},{"$f":"SUM(L535:L538)","v":34},{"$f":"SUM(M535:M538)","v":34},{"$f":"SUM(N535:N538)","v":0}]
[]
["Group 3"]
[]
[{"$f":"$B65","v":"Corentin Bouchez (BEL)"},{"$f":"IF('Séries individuels'!D58=\"\",\"\",'Séries individuels'!D58)","v":5},"-",{"$f":"IF('Séries individuels'!F58=\"\",\"\",'Séries individuels'!F58)","v":0},{"$f":"$C65","v":"Gonzalo García-Guereta (ESP)"},null,null,"P","W","L","N","+","-","d","PTS",null,null,"P","W","L","N","+","-","d","PTS"]
[{"$f":"$D65","v":"Daniel Vranovitz (AUT)"},{"$f":"IF('Séries individuels'!D59=\"\",\"\",'Séries individuels'!D59)","v":0},"-",{"$f":"IF('Séries individuels'!F59=\"\",\"\",'Séries individuels'!F59)","v":5},{"$f":"$E65","v":"Claudio La Torre (ITA)"},null,{"$f":"A543","v":"Corentin Bouchez (BEL)"},{"$f":"IF(B543=\"\",0,1)+IF(B545=\"\",0,1)+IF(D547=\"\",0,1)","v":3},{"$f":"IF(B543>D543,1,0)+IF(B545>D545,1,0)+IF(D547>B547,1,0)","v":2},{"$f":"IF(B543<D543,1,0)+IF(B545<D545,1,0)+IF(D547<B547,1,0)","v":1},{"$f":"IF(B543=\"\",0,IF(B543=D543,1,0))+IF(B545=\"\",0,IF(B545=D545,1,0))+IF(B547=\"\",0,IF(B547=D547,1,0))","v":0},{"$f":"IF(B543=\"\",0,+B543)+IF(B545=\"\",0,+B545)+IF(D547=\"\",0,+D547)","v":8},{"$f":"IF(D543=\"\",0,+D543)+IF(D545=\"\",0,+D545)+IF(B547=\"\",0,+B547)","v":7},{"$f":"L544-M544","v":1},{"$f":"I544*3+K544","v":6},null,"Claudio La Torre (ITA)",3,3,0,0,15,0,15,9]
[{"$f":"$B65","v":"Corentin Bouchez (BEL)"},{"$f":"IF('Séries individuels'!D253=\"\",\"\",'Séries individuels'!D253)","v":3},"-",{"$f":"IF('Séries individuels'!F253=\"\",\"\",'Séries individuels'!F253)","v":2},{"$f":"$D65","v":"Daniel Vranovitz (AUT)"},null,{"$f":"E543","v":"Gonzalo García-Guereta (ESP)"},{"$f":"IF(D543=\"\",0,1)+IF(B546=\"\",0,1)+IF(B548=\"\",0,1)","v":3},{"$f":"IF(D543>B543,1,0)+IF(B546>D546,1,0)+IF(B548>D548,1,0)","v":0},{"$f":"IF(D543<B543,1,0)+IF(B546<D546,1,0)+IF(B548<D548,1,0)","v":3},{"$f":"IF(B543=\"\",0,IF(B543=D543,1,0))+IF(B546=\"\",0,IF(B546=D546,1,0))+IF(B548=\"\",0,IF(B548=D548,1,0))","v":0},{"$f":"IF(D543=\"\",0,+D543)+IF(B546=\"\",0,+B546)+IF(B548=\"\",0,+B548)","v":0},{"$f":"IF(B543=\"\",0,+B543)+IF(D546=\"\",0,+D546)+IF(D548=\"\",0,+D548)","v":15},{"$f":"L545-M545","v":-15},{"$f":"I545*3+K545","v":0},null,"Corentin Bouchez (BEL)",3,2,1,0,8,7,1,6]
[{"$f":"$C65","v":"Gonzalo García-Guereta (ESP)"},{"$f":"IF('Séries individuels'!D254=\"\",\"\",'Séries individuels'!D254)","v":0},"-",{"$f":"IF('Séries individuels'!F254=\"\",\"\",'Séries individuels'!F254)","v":5},{"$f":"$E65","v":"Claudio La Torre (ITA)"},null,{"$f":"A544","v":"Daniel Vranovitz (AUT)"},{"$f":"IF(B544=\"\",0,1)+IF(D545=\"\",0,1)+IF(D548=\"\",0,1)","v":3},{"$f":"IF(B544>D544,1,0)+IF(D545>B545,1,0)+IF(D548>B548,1,0)","v":1},{"$f":"IF(B544<D544,1,0)+IF(D545<B545,1,0)+IF(D548<B548,1,0)","v":2},{"$f":"IF(B544=\"\",0,IF(B544=D544,1,0))+IF(B545=\"\",0,IF(B545=D545,1,0))+IF(B548=\"\",0,IF(B548=D548,1,0))","v":0},{"$f":"IF(B544=\"\",0,+B544)+IF(D545=\"\",0,+D545)+IF(D548=\"\",0,+D548)","v":7},{"$f":"IF(D544=\"\",0,+D544)+IF(B545=\"\",0,+B545)+IF(B548=\"\",0,+B548)","v":8},{"$f":"L546-M546","v":-1},{"$f":"I546*3+K546","v":3},null,"Daniel Vranovitz (AUT)",3,1,2,0,7,8,-1,3]
[{"$f":"$E65","v":"Claudio La Torre (ITA)"},{"$f":"IF('Séries individuels'!D387=\"\",\"\",'Séries individuels'!D387)","v":5},"-",{"$f":"IF('Séries individuels'!F387=\"\",\"\",'Séries individuels'!F387)","v":0},{"$f":"$B65","v":"Corentin Bouchez (BEL)"},null,{"$f":"E544","v":"Claudio La Torre (ITA)"},{"$f":"IF(D544=\"\",0,1)+IF(D546=\"\",0,1)+IF(B547=\"\",0,1)","v":3},{"$f":"IF(D544>B544,1,0)+IF(D546>B546,1,0)+IF(B547>D547,1,0)","v":3},{"$f":"IF(D544<B544,1,0)+IF(D546<B546,1,0)+IF(B547<D547,1,0)","v":0},{"$f":"IF(B544=\"\",0,IF(B544=D544,1,0))+IF(B546=\"\",0,IF(B546=D546,1,0))+IF(B547=\"\",0,IF(B547=D547,1,0))","v":0},{"$f":"IF(D544=\"\",0,+D544)+IF(D546=\"\",0,+D546)+IF(B547=\"\",0,+B547)","v":15},{"$f":"IF(B544=\"\",0,+B544)+IF(B546=\"\",0,+B546)+IF(D547=\"\",0,+D547)","v":0},{"$f":"L547-M547","v":15},{"$f":"I547*3+K547","v":9},null,"Gonzalo García-Guereta (ESP)",3,0,3,0,0,15,-15,0]
[{"$f":"$C65","v":"Gonzalo García-Guereta (ESP)"},{"$f":"IF('Séries individuels'!D388=\"\",\"\",'Séries individuels'!D388)","v":0},"-",{"$f":"IF('Séries individuels'!F388=\"\",\"\",'Séries individuels'!F388)","v":5},{"$f":"$D65","v":"Daniel Vranovitz (AUT)"},null,null,null,{"$f":"SUM(I544:I547)","v":6},{"$f":"SUM(J544:J547)","v":6},{"$f":"SUM(K544:K547)","v":0},{"$f":"SUM(L544:L547)","v":30},{"$f":"SUM(M544:M547)","v":30},{"$f":"SUM(N544:N547)","v":0}]
[]
["Group 4"]
[]
[{"$f":"$B66","v":"Jurgen Balzan (MLT)"},{"$f":"IF('Séries individuels'!D60=\"\",\"\",'Séries individuels'!D60)","v":5},"-",{"$f":"IF('Séries individuels'!F60=\"\",\"\",'Séries individuels'!F60)","v":0},{"$f":"$C66","v":"Yannick Matusch (GER)"},null,null,"P","W","L","N","+","-","d","PTS",null,null,"P","W","L","N","+","-","d","PTS"]
[{"$f":"$D66","v":"Louison Giaux (BEL)"},{"$f":"IF('Séries individuels'!D61=\"\",\"\",'Séries individuels'!D61)","v":1},"-",{"$f":"IF('Séries individuels'!F61=\"\",\"\",'Séries individuels'!F61)","v":1},{"$f":"$E66","v":"Jorge Pinero (ESP)"},null,{"$f":"A552","v":"Jurgen Balzan (MLT)"},{"$f":"IF(B552=\"\",0,1)+IF(B554=\"\",0,1)+IF(D556=\"\",0,1)","v":3},{"$f":"IF(B552>D552,1,0)+IF(B554>D554,1,0)+IF(D556>B556,1,0)","v":3},{"$f":"IF(B552<D552,1,0)+IF(B554<D554,1,0)+IF(D556<B556,1,0)","v":0},{"$f":"IF(B552=\"\",0,IF(B552=D552,1,0))+IF(B554=\"\",0,IF(B554=D554,1,0))+IF(B556=\"\",0,IF(B556=D556,1,0))","v":0},{"$f":"IF(B552=\"\",0,+B552)+IF(B554=\"\",0,+B554)+IF(D556=\"\",0,+D556)","v":13},{"$f":"IF(D552=\"\",0,+D552)+IF(D554=\"\",0,+D554)+IF(B556=\"\",0,+B556)","v":1},{"$f":"L553-M553","v":12},{"$f":"I553*3+K553","v":9},null,"Jurgen Balzan (MLT)",3,3,0,0,13,1,12,9]
[{"$f":"$B66","v":"Jurgen Balzan (MLT)"},{"$f":"IF('Séries individuels'!D255=\"\",\"\",'Séries individuels'!D255)","v":3},"-",{"$f":"IF('Séries individuels'!F255=\"\",\"\",'Séries individuels'!F255)","v":1},{"$f":"$D66","v":"Louison Giaux (BEL)"},null,{"$f":"E552","v":"Yannick Matusch (GER)"},{"$f":"IF(D552=\"\",0,1)+IF(B555=\"\",0,1)+IF(B557=\"\",0,1)","v":3},{"$f":"IF(D552>B552,1,0)+IF(B555>D555,1,0)+IF(B557>D557,1,0)","v":1},{"$f":"IF(D552<B552,1,0)+IF(B555<D555,1,0)+IF(B557<D557,1,0)","v":2},{"$f":"IF(B552=\"\",0,IF(B552=D552,1,0))+IF(B555=\"\",0,IF(B555=D555,1,0))+IF(B557=\"\",0,IF(B557=D557,1,0))","v":0},{"$f":"IF(D552=\"\",0,+D552)+IF(B555=\"\",0,+B555)+IF(B557=\"\",0,+B557)","v":1},{"$f":"IF(B552=\"\",0,+B552)+IF(D555=\"\",0,+D555)+IF(D557=\"\",0,+D557)","v":9},{"$f":"L554-M554","v":-8},{"$f":"I554*3+K554","v":3},null,"Louison Giaux (BEL)",3,1,1,1,6,4,2,4]
[{"$f":"$C66","v":"Yannick Matusch (GER)"},{"$f":"IF('Séries individuels'!D256=\"\",\"\",'Séries individuels'!D256)","v":1},"-",{"$f":"IF('Séries individuels'!F256=\"\",\"\",'Séries individuels'!F256)","v":0},{"$f":"$E66","v":"Jorge Pinero (ESP)"},null,{"$f":"A553","v":"Louison Giaux (BEL)"},{"$f":"IF(B553=\"\",0,1)+IF(D554=\"\",0,1)+IF(D557=\"\",0,1)","v":3},{"$f":"IF(B553>D553,1,0)+IF(D554>B554,1,0)+IF(D557>B557,1,0)","v":1},{"$f":"IF(B553<D553,1,0)+IF(D554<B554,1,0)+IF(D557<B557,1,0)","v":1},{"$f":"IF(B553=\"\",0,IF(B553=D553,1,0))+IF(B554=\"\",0,IF(B554=D554,1,0))+IF(B557=\"\",0,IF(B557=D557,1,0))","v":1},{"$f":"IF(B553=\"\",0,+B553)+IF(D554=\"\",0,+D554)+IF(D557=\"\",0,+D557)","v":6},{"$f":"IF(D553=\"\",0,+D553)+IF(B554=\"\",0,+B554)+IF(B557=\"\",0,+B557)","v":4},{"$f":"L555-M555","v":2},{"$f":"I555*3+K555","v":4},null,"Yannick Matusch (GER)",3,1,2,0,1,9,-8,3]
[{"$f":"$E66","v":"Jorge Pinero (ESP)"},{"$f":"IF('Séries individuels'!D389=\"\",\"\",'Séries individuels'!D389)","v":0},"-",{"$f":"IF('Séries individuels'!F389=\"\",\"\",'Séries individuels'!F389)","v":5},{"$f":"$B66","v":"Jurgen Balzan (MLT)"},null,{"$f":"E553","v":"Jorge Pinero (ESP)"},{"$f":"IF(D553=\"\",0,1)+IF(D555=\"\",0,1)+IF(B556=\"\",0,1)","v":3},{"$f":"IF(D553>B553,1,0)+IF(D555>B555,1,0)+IF(B556>D556,1,0)","v":0},{"$f":"IF(D553<B553,1,0)+IF(D555<B555,1,0)+IF(B556<D556,1,0)","v":2},{"$f":"IF(B553=\"\",0,IF(B553=D553,1,0))+IF(B555=\"\",0,IF(B555=D555,1,0))+IF(B556=\"\",0,IF(B556=D556,1,0))","v":1},{"$f":"IF(D553=\"\",0,+D553)+IF(D555=\"\",0,+D555)+IF(B556=\"\",0,+B556)","v":1},{"$f":"IF(B553=\"\",0,+B553)+IF(B555=\"\",0,+B555)+IF(D556=\"\",0,+D556)","v":7},{"$f":"L556-M556","v":-6},{"$f":"I556*3+K556","v":1},null,"Jorge Pinero (ESP)",3,0,2,1,1,7,-6,1]
[{"$f":"$C66","v":"Yannick Matusch (GER)"},{"$f":"IF('Séries individuels'!D390=\"\",\"\",'Séries individuels'!D390)","v":0},"-",{"$f":"IF('Séries individuels'!F390=\"\",\"\",'Séries individuels'!F390)","v":4},{"$f":"$D66","v":"Louison Giaux (BEL)"},null,null,null,{"$f":"SUM(I553:I556)","v":5},{"$f":"SUM(J553:J556)","v":5},{"$f":"SUM(K553:K556)","v":2},{"$f":"SUM(L553:L556)","v":21},{"$f":"SUM(M553:M556)","v":21},{"$f":"SUM(N553:N556)","v":0}]
[]
["Group 5"]
[]
[{"$f":"$B67","v":"Leonardo Giudice (ITA)"},{"$f":"IF('Séries individuels'!D119=\"\",\"\",'Séries individuels'!D119)","v":5},"-",{"$f":"IF('Séries individuels'!F119=\"\",\"\",'Séries individuels'!F119)","v":0},{"$f":"$C67","v":"Niall Dean (GIB)"},null,null,"P","W","L","N","+","-","d","PTS",null,null,"P","W","L","N","+","-","d","PTS"]
[{"$f":"$D67","v":"Thomas Price (ENG)"},{"$f":"IF('Séries individuels'!D120=\"\",\"\",'Séries individuels'!D120)","v":2},"-",{"$f":"IF('Séries individuels'!F120=\"\",\"\",'Séries individuels'!F120)","v":3},{"$f":"$E67","v":"Corentin Boltz (BEL)"},null,{"$f":"A561","v":"Leonardo Giudice (ITA)"},{"$f":"IF(B561=\"\",0,1)+IF(B563=\"\",0,1)+IF(D565=\"\",0,1)","v":3},{"$f":"IF(B561>D561,1,0)+IF(B563>D563,1,0)+IF(D565>B565,1,0)","v":3},{"$f":"IF(B561<D561,1,0)+IF(B563<D563,1,0)+IF(D565<B565,1,0)","v":0},{"$f":"IF(B561=\"\",0,IF(B561=D561,1,0))+IF(B563=\"\",0,IF(B563=D563,1,0))+IF(B565=\"\",0,IF(B565=D565,1,0))","v":0},{"$f":"IF(B561=\"\",0,+B561)+IF(B563=\"\",0,+B563)+IF(D565=\"\",0,+D565)","v":15},{"$f":"IF(D561=\"\",0,+D561)+IF(D563=\"\",0,+D563)+IF(B565=\"\",0,+B565)","v":0},{"$f":"L562-M562","v":15},{"$f":"I562*3+K562","v":9},null,"Leonardo Giudice (ITA)",3,3,0,0,15,0,15,9]
[{"$f":"$B67","v":"Leonardo Giudice (ITA)"},{"$f":"IF('Séries individuels'!D257=\"\",\"\",'Séries individuels'!D257)","v":5},"-",{"$f":"IF('Séries individuels'!F257=\"\",\"\",'Séries individuels'!F257)","v":0},{"$f":"$D67","v":"Thomas Price (ENG)"},null,{"$f":"E561","v":"Niall Dean (GIB)"},{"$f":"IF(D561=\"\",0,1)+IF(B564=\"\",0,1)+IF(B566=\"\",0,1)","v":3},{"$f":"IF(D561>B561,1,0)+IF(B564>D564,1,0)+IF(B566>D566,1,0)","v":1},{"$f":"IF(D561<B561,1,0)+IF(B564<D564,1,0)+IF(B566<D566,1,0)","v":1},{"$f":"IF(B561=\"\",0,IF(B561=D561,1,0))+IF(B564=\"\",0,IF(B564=D564,1,0))+IF(B566=\"\",0,IF(B566=D566,1,0))","v":1},{"$f":"IF(D561=\"\",0,+D561)+IF(B564=\"\",0,+B564)+IF(B566=\"\",0,+B566)","v":5},{"$f":"IF(B561=\"\",0,+B561)+IF(D564=\"\",0,+D564)+IF(D566=\"\",0,+D566)","v":7},{"$f":"L563-M563","v":-2},{"$f":"I563*3+K563","v":4},null,"Niall Dean (GIB)",3,1,1,1,5,7,-2,4]
[{"$f":"$C67","v":"Niall Dean (GIB)"},{"$f":"IF('Séries individuels'!D258=\"\",\"\",'Séries individuels'!D258)","v":2},"-",{"$f":"IF('Séries individuels'!F258=\"\",\"\",'Séries individuels'!F258)","v":2},{"$f":"$E67","v":"Corentin Boltz (BEL)"},null,{"$f":"A562","v":"Thomas Price (ENG)"},{"$f":"IF(B562=\"\",0,1)+IF(D563=\"\",0,1)+IF(D566=\"\",0,1)","v":3},{"$f":"IF(B562>D562,1,0)+IF(D563>B563,1,0)+IF(D566>B566,1,0)","v":0},{"$f":"IF(B562<D562,1,0)+IF(D563<B563,1,0)+IF(D566<B566,1,0)","v":3},{"$f":"IF(B562=\"\",0,IF(B562=D562,1,0))+IF(B563=\"\",0,IF(B563=D563,1,0))+IF(B566=\"\",0,IF(B566=D566,1,0))","v":0},{"$f":"IF(B562=\"\",0,+B562)+IF(D563=\"\",0,+D563)+IF(D566=\"\",0,+D566)","v":2},{"$f":"IF(D562=\"\",0,+D562)+IF(B563=\"\",0,+B563)+IF(B566=\"\",0,+B566)","v":11},{"$f":"L564-M564","v":-9},{"$f":"I564*3+K564","v":0},null,"Corentin Boltz (BEL)",3,1,1,1,5,9,-4,4]
[{"$f":"$E67","v":"Corentin Boltz (BEL)"},{"$f":"IF('Séries individuels'!D454=\"\",\"\",'Séries individuels'!D454)","v":0},"-",{"$f":"IF('Séries individuels'!F454=\"\",\"\",'Séries individuels'!F454)","v":5},{"$f":"$B67","v":"Leonardo Giudice (ITA)"},null,{"$f":"E562","v":"Corentin Boltz (BEL)"},{"$f":"IF(D562=\"\",0,1)+IF(D564=\"\",0,1)+IF(B565=\"\",0,1)","v":3},{"$f":"IF(D562>B562,1,0)+IF(D564>B564,1,0)+IF(B565>D565,1,0)","v":1},{"$f":"IF(D562<B562,1,0)+IF(D564<B564,1,0)+IF(B565<D565,1,0)","v":1},{"$f":"IF(B562=\"\",0,IF(B562=D562,1,0))+IF(B564=\"\",0,IF(B564=D564,1,0))+IF(B565=\"\",0,IF(B565=D565,1,0))","v":1},{"$f":"IF(D562=\"\",0,+D562)+IF(D564=\"\",0,+D564)+IF(B565=\"\",0,+B565)","v":5},{"$f":"IF(B562=\"\",0,+B562)+IF(B564=\"\",0,+B564)+IF(D565=\"\",0,+D565)","v":9},{"$f":"L565-M565","v":-4},{"$f":"I565*3+K565","v":4},null,"Thomas Price (ENG)",3,0,3,0,2,11,-9,0]
[{"$f":"$C67","v":"Niall Dean (GIB)"},{"$f":"IF('Séries individuels'!D455=\"\",\"\",'Séries individuels'!D455)","v":3},"-",{"$f":"IF('Séries individuels'!F455=\"\",\"\",'Séries individuels'!F455)","v":0},{"$f":"$D67","v":"Thomas Price (ENG)"},null,null,null,{"$f":"SUM(I562:I565)","v":5},{"$f":"SUM(J562:J565)","v":5},{"$f":"SUM(K562:K565)","v":2},{"$f":"SUM(L562:L565)","v":27},{"$f":"SUM(M562:M565)","v":27},{"$f":"SUM(N562:N565)","v":0}]
[]
["Group 6"]
[]
[{"$f":"$B68","v":"Alwin Krause (GER)"},{"$f":"IF('Séries individuels'!D121=\"\",\"\",'Séries individuels'!D121)","v":1},"-",{"$f":"IF('Séries individuels'!F121=\"\",\"\",'Séries individuels'!F121)","v":0},{"$f":"$C68","v":"Antonio García Fernández (ESP)"},null,null,"P","W","L","N","+","-","d","PTS",null,null,"P","W","L","N","+","-","d","PTS"]
[{"$f":"$D68","v":"Eliott Legall (FRA)"},{"$f":"IF('Séries individuels'!D122=\"\",\"\",'Séries individuels'!D122)","v":1},"-",{"$f":"IF('Séries individuels'!F122=\"\",\"\",'Séries individuels'!F122)","v":0},{"$f":"$E68","v":"Jonathan Nichtenberger (AUT)"},null,{"$f":"A570","v":"Alwin Krause (GER)"},{"$f":"IF(B570=\"\",0,1)+IF(B572=\"\",0,1)+IF(D574=\"\",0,1)","v":3},{"$f":"IF(B570>D570,1,0)+IF(B572>D572,1,0)+IF(D574>B574,1,0)","v":2},{"$f":"IF(B570<D570,1,0)+IF(B572<D572,1,0)+IF(D574<B574,1,0)","v":0},{"$f":"IF(B570=\"\",0,IF(B570=D570,1,0))+IF(B572=\"\",0,IF(B572=D572,1,0))+IF(B574=\"\",0,IF(B574=D574,1,0))","v":1},{"$f":"IF(B570=\"\",0,+B570)+IF(B572=\"\",0,+B572)+IF(D574=\"\",0,+D574)","v":8},{"$f":"IF(D570=\"\",0,+D570)+IF(D572=\"\",0,+D572)+IF(B574=\"\",0,+B574)","v":4},{"$f":"L571-M571","v":4},{"$f":"I571*3+K571","v":7},null,"Alwin Krause (GER)",3,2,0,1,8,4,4,7]
[{"$f":"$B68","v":"Alwin Krause (GER)"},{"$f":"IF('Séries individuels'!D259=\"\",\"\",'Séries individuels'!D259)","v":4},"-",{"$f":"IF('Séries individuels'!F259=\"\",\"\",'Séries individuels'!F259)","v":1},{"$f":"$D68","v":"Eliott Legall (FRA)"},null,{"$f":"E570","v":"Antonio García Fernández (ESP)"},{"$f":"IF(D570=\"\",0,1)+IF(B573=\"\",0,1)+IF(B575=\"\",0,1)","v":3},{"$f":"IF(D570>B570,1,0)+IF(B573>D573,1,0)+IF(B575>D575,1,0)","v":2},{"$f":"IF(D570<B570,1,0)+IF(B573<D573,1,0)+IF(B575<D575,1,0)","v":1},{"$f":"IF(B570=\"\",0,IF(B570=D570,1,0))+IF(B573=\"\",0,IF(B573=D573,1,0))+IF(B575=\"\",0,IF(B575=D575,1,0))","v":0},{"$f":"IF(D570=\"\",0,+D570)+IF(B573=\"\",0,+B573)+IF(B575=\"\",0,+B575)","v":9},{"$f":"IF(B570=\"\",0,+B570)+IF(D573=\"\",0,+D573)+IF(D575=\"\",0,+D575)","v":4},{"$f":"L572-M572","v":5},{"$f":"I572*3+K572","v":6},null,"Antonio García Fernández (ESP)",3,2,1,0,9,4,5,6]
[{"$f":"$C68","v":"Antonio García Fernández (ESP)"},{"$f":"IF('Séries individuels'!D260=\"\",\"\",'Séries individuels'!D260)","v":6},"-",{"$f":"IF('Séries individuels'!F260=\"\",\"\",'Séries individuels'!F260)","v":3},{"$f":"$E68","v":"Jonathan Nichtenberger (AUT)"},null,{"$f":"A571","v":"Eliott Legall (FRA)"},{"$f":"IF(B571=\"\",0,1)+IF(D572=\"\",0,1)+IF(D575=\"\",0,1)","v":3},{"$f":"IF(B571>D571,1,0)+IF(D572>B572,1,0)+IF(D575>B575,1,0)","v":1},{"$f":"IF(B571<D571,1,0)+IF(D572<B572,1,0)+IF(D575<B575,1,0)","v":2},{"$f":"IF(B571=\"\",0,IF(B571=D571,1,0))+IF(B572=\"\",0,IF(B572=D572,1,0))+IF(B575=\"\",0,IF(B575=D575,1,0))","v":0},{"$f":"IF(B571=\"\",0,+B571)+IF(D572=\"\",0,+D572)+IF(D575=\"\",0,+D575)","v":2},{"$f":"IF(D571=\"\",0,+D571)+IF(B572=\"\",0,+B572)+IF(B575=\"\",0,+B575)","v":7},{"$f":"L573-M573","v":-5},{"$f":"I573*3+K573","v":3},null,"Eliott Legall (FRA)",3,1,2,0,2,7,-5,3]
[{"$f":"$E68","v":"Jonathan Nichtenberger (AUT)"},{"$f":"IF('Séries individuels'!D456=\"\",\"\",'Séries individuels'!D456)","v":3},"-",{"$f":"IF('Séries individuels'!F456=\"\",\"\",'Séries individuels'!F456)","v":3},{"$f":"$B68","v":"Alwin Krause (GER)"},null,{"$f":"E571","v":"Jonathan Nichtenberger (AUT)"},{"$f":"IF(D571=\"\",0,1)+IF(D573=\"\",0,1)+IF(B574=\"\",0,1)","v":3},{"$f":"IF(D571>B571,1,0)+IF(D573>B573,1,0)+IF(B574>D574,1,0)","v":0},{"$f":"IF(D571<B571,1,0)+IF(D573<B573,1,0)+IF(B574<D574,1,0)","v":2},{"$f":"IF(B571=\"\",0,IF(B571=D571,1,0))+IF(B573=\"\",0,IF(B573=D573,1,0))+IF(B574=\"\",0,IF(B574=D574,1,0))","v":1},{"$f":"IF(D571=\"\",0,+D571)+IF(D573=\"\",0,+D573)+IF(B574=\"\",0,+B574)","v":6},{"$f":"IF(B571=\"\",0,+B571)+IF(B573=\"\",0,+B573)+IF(D574=\"\",0,+D574)","v":10},{"$f":"L574-M574","v":-4},{"$f":"I574*3+K574","v":1},null,"Jonathan Nichtenberger (AUT)",3,0,2,1,6,10,-4,1]
[{"$f":"$C68","v":"Antonio García Fernández (ESP)"},{"$f":"IF('Séries individuels'!D457=\"\",\"\",'Séries individuels'!D457)","v":3},"-",{"$f":"IF('Séries individuels'!F457=\"\",\"\",'Séries individuels'!F457)","v":0},{"$f":"$D68","v":"Eliott Legall (FRA)"},null,null,null,{"$f":"SUM(I571:I574)","v":5},{"$f":"SUM(J571:J574)","v":5},{"$f":"SUM(K571:K574)","v":2},{"$f":"SUM(L571:L574)","v":25},{"$f":"SUM(M571:M574)","v":25},{"$f":"SUM(N571:N574)","v":0}]
[]
["Group 7"]
[]
[{"$f":"$B69","v":"Kye Arnold (ENG)"},{"$f":"IF('Séries individuels'!D184=\"\",\"\",'Séries individuels'!D184)","v":0},"-",{"$f":"IF('Séries individuels'!F184=\"\",\"\",'Séries individuels'!F184)","v":5},{"$f":"$C69","v":"Moritz Jung (GER)"},null,null,"P","W","L","N","+","-","d","PTS",null,null,"P","W","L","N","+","-","d","PTS"]
[{"$f":"$D69","v":"Antonio La Torre (ITA)"},5,"-",0,{"$f":"$E69","v":"Paul Offmann (FRA)"},null,{"$f":"A579","v":"Kye Arnold (ENG)"},{"$f":"IF(B579=\"\",0,1)+IF(B581=\"\",0,1)+IF(D583=\"\",0,1)","v":3},{"$f":"IF(B579>D579,1,0)+IF(B581>D581,1,0)+IF(D583>B583,1,0)","v":1},{"$f":"IF(B579<D579,1,0)+IF(B581<D581,1,0)+IF(D583<B583,1,0)","v":2},{"$f":"IF(B579=\"\",0,IF(B579=D579,1,0))+IF(B581=\"\",0,IF(B581=D581,1,0))+IF(B583=\"\",0,IF(B583=D583,1,0))","v":0},{"$f":"IF(B579=\"\",0,+B579)+IF(B581=\"\",0,+B581)+IF(D583=\"\",0,+D583)","v":3},{"$f":"IF(D579=\"\",0,+D579)+IF(D581=\"\",0,+D581)+IF(B583=\"\",0,+B583)","v":10},{"$f":"L580-M580","v":-7},{"$f":"I580*3+K580","v":3},null,"Moritz Jung (GER)",3,3,0,0,13,2,11,9]
[{"$f":"$B69","v":"Kye Arnold (ENG)"},{"$f":"IF('Séries individuels'!D322=\"\",\"\",'Séries individuels'!D322)","v":0},"-",{"$f":"IF('Séries individuels'!F322=\"\",\"\",'Séries individuels'!F322)","v":5},{"$f":"$D69","v":"Antonio La Torre (ITA)"},null,{"$f":"E579","v":"Moritz Jung (GER)"},{"$f":"IF(D579=\"\",0,1)+IF(B582=\"\",0,1)+IF(B584=\"\",0,1)","v":3},{"$f":"IF(D579>B579,1,0)+IF(B582>D582,1,0)+IF(B584>D584,1,0)","v":3},{"$f":"IF(D579<B579,1,0)+IF(B582<D582,1,0)+IF(B584<D584,1,0)","v":0},{"$f":"IF(B579=\"\",0,IF(B579=D579,1,0))+IF(B582=\"\",0,IF(B582=D582,1,0))+IF(B584=\"\",0,IF(B584=D584,1,0))","v":0},{"$f":"IF(D579=\"\",0,+D579)+IF(B582=\"\",0,+B582)+IF(B584=\"\",0,+B584)","v":13},{"$f":"IF(B579=\"\",0,+B579)+IF(D582=\"\",0,+D582)+IF(D584=\"\",0,+D584)","v":2},{"$f":"L581-M581","v":11},{"$f":"I581*3+K581","v":9},null,"Antonio La Torre (ITA)",3,2,1,0,12,3,9,6]
[{"$f":"$C69","v":"Moritz Jung (GER)"},{"$f":"IF('Séries individuels'!D323=\"\",\"\",'Séries individuels'!D323)","v":5},"-",{"$f":"IF('Séries individuels'!F323=\"\",\"\",'Séries individuels'!F323)","v":0},{"$f":"$E69","v":"Paul Offmann (FRA)"},null,{"$f":"A580","v":"Antonio La Torre (ITA)"},{"$f":"IF(B580=\"\",0,1)+IF(D581=\"\",0,1)+IF(D584=\"\",0,1)","v":3},{"$f":"IF(B580>D580,1,0)+IF(D581>B581,1,0)+IF(D584>B584,1,0)","v":2},{"$f":"IF(B580<D580,1,0)+IF(D581<B581,1,0)+IF(D584<B584,1,0)","v":1},{"$f":"IF(B580=\"\",0,IF(B580=D580,1,0))+IF(B581=\"\",0,IF(B581=D581,1,0))+IF(B584=\"\",0,IF(B584=D584,1,0))","v":0},{"$f":"IF(B580=\"\",0,+B580)+IF(D581=\"\",0,+D581)+IF(D584=\"\",0,+D584)","v":12},{"$f":"IF(D580=\"\",0,+D580)+IF(B581=\"\",0,+B581)+IF(B584=\"\",0,+B584)","v":3},{"$f":"L582-M582","v":9},{"$f":"I582*3+K582","v":6},null,"Kye Arnold (ENG)",3,1,2,0,3,10,-7,3]
[{"$f":"$E69","v":"Paul Offmann (FRA)"},{"$f":"IF('Séries individuels'!D458=\"\",\"\",'Séries individuels'!D458)","v":0},"-",{"$f":"IF('Séries individuels'!F458=\"\",\"\",'Séries individuels'!F458)","v":3},{"$f":"$B69","v":"Kye Arnold (ENG)"},null,{"$f":"E580","v":"Paul Offmann (FRA)"},{"$f":"IF(D580=\"\",0,1)+IF(D582=\"\",0,1)+IF(B583=\"\",0,1)","v":3},{"$f":"IF(D580>B580,1,0)+IF(D582>B582,1,0)+IF(B583>D583,1,0)","v":0},{"$f":"IF(D580<B580,1,0)+IF(D582<B582,1,0)+IF(B583<D583,1,0)","v":3},{"$f":"IF(B580=\"\",0,IF(B580=D580,1,0))+IF(B582=\"\",0,IF(B582=D582,1,0))+IF(B583=\"\",0,IF(B583=D583,1,0))","v":0},{"$f":"IF(D580=\"\",0,+D580)+IF(D582=\"\",0,+D582)+IF(B583=\"\",0,+B583)","v":0},{"$f":"IF(B580=\"\",0,+B580)+IF(B582=\"\",0,+B582)+IF(D583=\"\",0,+D583)","v":13},{"$f":"L583-M583","v":-13},{"$f":"I583*3+K583","v":0},null,"Paul Offmann (FRA)",3,0,3,0,0,13,-13,0]
[{"$f":"$C69","v":"Moritz Jung (GER)"},{"$f":"IF('Séries individuels'!D459=\"\",\"\",'Séries individuels'!D459)","v":3},"-",{"$f":"IF('Séries individuels'!F459=\"\",\"\",'Séries individuels'!F459)","v":2},{"$f":"$D69","v":"Antonio La Torre (ITA)"},null,null,null,{"$f":"SUM(I580:I583)","v":6},{"$f":"SUM(J580:J583)","v":6},{"$f":"SUM(K580:K583)","v":0},{"$f":"SUM(L580:L583)","v":28},{"$f":"SUM(M580:M583)","v":28},{"$f":"SUM(N580:N583)","v":0}]
[]
["Group 8"]
[]
[{"$f":"$B70","v":"Lukas Eppensteiner (AUT)"},{"$f":"IF('Séries individuels'!D186=\"\",\"\",'Séries individuels'!D186)","v":1},"-",{"$f":"IF('Séries individuels'!F186=\"\",\"\",'Séries individuels'!F186)","v":1},{"$f":"$C70","v":"Matteo Brillantino (ITA)"},null,null,"P","W","L","N","+","-","d","PTS",null,null,"P","W","L","N","+","-","d","PTS"]
[{"$f":"$D70","v":"Rhys Williams (ENG)"},{"$f":"IF('Séries individuels'!D187=\"\",\"\",'Séries individuels'!D187)","v":1},"-",{"$f":"IF('Séries individuels'!F187=\"\",\"\",'Séries individuels'!F187)","v":2},{"$f":"$E70","v":"Mathéo Grégoire (BEL)"},null,{"$f":"A588","v":"Lukas Eppensteiner (AUT)"},{"$f":"IF(B588=\"\",0,1)+IF(B590=\"\",0,1)+IF(D592=\"\",0,1)","v":3},{"$f":"IF(B588>D588,1,0)+IF(B590>D590,1,0)+IF(D592>B592,1,0)","v":2},{"$f":"IF(B588<D588,1,0)+IF(B590<D590,1,0)+IF(D592<B592,1,0)","v":0},{"$f":"IF(B588=\"\",0,IF(B588=D588,1,0))+IF(B590=\"\",0,IF(B590=D590,1,0))+IF(B592=\"\",0,IF(B592=D592,1,0))","v":1},{"$f":"IF(B588=\"\",0,+B588)+IF(B590=\"\",0,+B590)+IF(D592=\"\",0,+D592)","v":7},{"$f":"IF(D588=\"\",0,+D588)+IF(D590=\"\",0,+D590)+IF(B592=\"\",0,+B592)","v":2},{"$f":"L589-M589","v":5},{"$f":"I589*3+K589","v":7},null,"Matteo Brillantino (ITA)",3,2,0,1,10,3,7,7]
[{"$f":"$B70","v":"Lukas Eppensteiner (AUT)"},{"$f":"IF('Séries individuels'!D324=\"\",\"\",'Séries individuels'!D324)","v":3},"-",{"$f":"IF('Séries individuels'!F324=\"\",\"\",'Séries individuels'!F324)","v":0},{"$f":"$D70","v":"Rhys Williams (ENG)"},null,{"$f":"E588","v":"Matteo Brillantino (ITA)"},{"$f":"IF(D588=\"\",0,1)+IF(B591=\"\",0,1)+IF(B593=\"\",0,1)","v":3},{"$f":"IF(D588>B588,1,0)+IF(B591>D591,1,0)+IF(B593>D593,1,0)","v":2},{"$f":"IF(D588<B588,1,0)+IF(B591<D591,1,0)+IF(B593<D593,1,0)","v":0},{"$f":"IF(B588=\"\",0,IF(B588=D588,1,0))+IF(B591=\"\",0,IF(B591=D591,1,0))+IF(B593=\"\",0,IF(B593=D593,1,0))","v":1},{"$f":"IF(D588=\"\",0,+D588)+IF(B591=\"\",0,+B591)+IF(B593=\"\",0,+B593)","v":10},{"$f":"IF(B588=\"\",0,+B588)+IF(D591=\"\",0,+D591)+IF(D593=\"\",0,+D593)","v":3},{"$f":"L590-M590","v":7},{"$f":"I590*3+K590","v":7},null,"Lukas Eppensteiner (AUT)",3,2,0,1,7,2,5,7]
[{"$f":"$C70","v":"Matteo Brillantino (ITA)"},{"$f":"IF('Séries individuels'!D325=\"\",\"\",'Séries individuels'!D325)","v":3},"-",{"$f":"IF('Séries individuels'!F325=\"\",\"\",'Séries individuels'!F325)","v":0},{"$f":"$E70","v":"Mathéo Grégoire (BEL)"},null,{"$f":"A589","v":"Rhys Williams (ENG)"},{"$f":"IF(B589=\"\",0,1)+IF(D590=\"\",0,1)+IF(D593=\"\",0,1)","v":3},{"$f":"IF(B589>D589,1,0)+IF(D590>B590,1,0)+IF(D593>B593,1,0)","v":0},{"$f":"IF(B589<D589,1,0)+IF(D590<B590,1,0)+IF(D593<B593,1,0)","v":3},{"$f":"IF(B589=\"\",0,IF(B589=D589,1,0))+IF(B590=\"\",0,IF(B590=D590,1,0))+IF(B593=\"\",0,IF(B593=D593,1,0))","v":0},{"$f":"IF(B589=\"\",0,+B589)+IF(D590=\"\",0,+D590)+IF(D593=\"\",0,+D593)","v":3},{"$f":"IF(D589=\"\",0,+D589)+IF(B590=\"\",0,+B590)+IF(B593=\"\",0,+B593)","v":11},{"$f":"L591-M591","v":-8},{"$f":"I591*3+K591","v":0},null,"Mathéo Grégoire (BEL)",3,1,2,0,3,7,-4,3]
[{"$f":"$E70","v":"Mathéo Grégoire (BEL)"},{"$f":"IF('Séries individuels'!D460=\"\",\"\",'Séries individuels'!D460)","v":1},"-",{"$f":"IF('Séries individuels'!F460=\"\",\"\",'Séries individuels'!F460)","v":3},{"$f":"$B70","v":"Lukas Eppensteiner (AUT)"},null,{"$f":"E589","v":"Mathéo Grégoire (BEL)"},{"$f":"IF(D589=\"\",0,1)+IF(D591=\"\",0,1)+IF(B592=\"\",0,1)","v":3},{"$f":"IF(D589>B589,1,0)+IF(D591>B591,1,0)+IF(B592>D592,1,0)","v":1},{"$f":"IF(D589<B589,1,0)+IF(D591<B591,1,0)+IF(B592<D592,1,0)","v":2},{"$f":"IF(B589=\"\",0,IF(B589=D589,1,0))+IF(B591=\"\",0,IF(B591=D591,1,0))+IF(B592=\"\",0,IF(B592=D592,1,0))","v":0},{"$f":"IF(D589=\"\",0,+D589)+IF(D591=\"\",0,+D591)+IF(B592=\"\",0,+B592)","v":3},{"$f":"IF(B589=\"\",0,+B589)+IF(B591=\"\",0,+B591)+IF(D592=\"\",0,+D592)","v":7},{"$f":"L592-M592","v":-4},{"$f":"I592*3+K592","v":3},null,"Rhys Williams (ENG)",3,0,3,0,3,11,-8,0]
[{"$f":"$C70","v":"Matteo Brillantino (ITA)"},{"$f":"IF('Séries individuels'!D461=\"\",\"\",'Séries individuels'!D461)","v":6},"-",{"$f":"IF('Séries individuels'!F461=\"\",\"\",'Séries individuels'!F461)","v":2},{"$f":"$D70","v":"Rhys Williams (ENG)"},null,null,null,{"$f":"SUM(I589:I592)","v":5},{"$f":"SUM(J589:J592)","v":5},{"$f":"SUM(K589:K592)","v":2},{"$f":"SUM(L589:L592)","v":23},{"$f":"SUM(M589:M592)","v":23},{"$f":"SUM(N589:N592)","v":0}]
[]
[]
["U12 category"]
[]
["Group 1"]
[]
[{"$f":"$B74","v":"Matteo Cammarata (ITA)"},{"$f":"IF('Séries individuels'!D62=\"\",\"\",'Séries individuels'!D62)","v":5},"-",{"$f":"IF('Séries individuels'!F62=\"\",\"\",'Séries individuels'!F62)","v":0},{"$f":"$C74","v":"Victor Dubuc (FRA)"},null,null,"P","W","L","N","+","-","d","PTS",null,null,"P","W","L","N","+","-","d","PTS"]
[{"$f":"$D74","v":"Jérôme Cyganek (BEL)"},{"$f":"IF('Séries individuels'!D63=\"\",\"\",'Séries individuels'!D63)","v":3},"-",{"$f":"IF('Séries individuels'!F63=\"\",\"\",'Séries individuels'!F63)","v":1},{"$f":"$E74","v":"Charlotte Bouchez (BEL)"},null,{"$f":"A600","v":"Matteo Cammarata (ITA)"},{"$f":"IF(B600=\"\",0,1)+IF(B602=\"\",0,1)+IF(D604=\"\",0,1)","v":3},{"$f":"IF(B600>D600,1,0)+IF(B602>D602,1,0)+IF(D604>B604,1,0)","v":3},{"$f":"IF(B600<D600,1,0)+IF(B602<D602,1,0)+IF(D604<B604,1,0)","v":0},{"$f":"IF(B600=\"\",0,IF(B600=D600,1,0))+IF(B602=\"\",0,IF(B602=D602,1,0))+IF(B604=\"\",0,IF(B604=D604,1,0))","v":0},{"$f":"IF(B600=\"\",0,+B600)+IF(B602=\"\",0,+B602)+IF(D604=\"\",0,+D604)","v":14},{"$f":"IF(D600=\"\",0,+D600)+IF(D602=\"\",0,+D602)+IF(B604=\"\",0,+B604)","v":0},{"$f":"L601-M601","v":14},{"$f":"I601*3+K601","v":9},null,"Matteo Cammarata (ITA)",3,3,0,0,14,0,14,9]
[{"$f":"$B74","v":"Matteo Cammarata (ITA)"},{"$f":"IF('Séries individuels'!D194=\"\",\"\",'Séries individuels'!D194)","v":5},"-",{"$f":"IF('Séries individuels'!F194=\"\",\"\",'Séries individuels'!F194)","v":0},{"$f":"$D74","v":"Jérôme Cyganek (BEL)"},null,{"$f":"E600","v":"Victor Dubuc (FRA)"},{"$f":"IF(D600=\"\",0,1)+IF(B603=\"\",0,1)+IF(B605=\"\",0,1)","v":3},{"$f":"IF(D600>B600,1,0)+IF(B603>D603,1,0)+IF(B605>D605,1,0)","v":0},{"$f":"IF(D600<B600,1,0)+IF(B603<D603,1,0)+IF(B605<D605,1,0)","v":1},{"$f":"IF(B600=\"\",0,IF(B600=D600,1,0))+IF(B603=\"\",0,IF(B603=D603,1,0))+IF(B605=\"\",0,IF(B605=D605,1,0))","v":2},{"$f":"IF(D600=\"\",0,+D600)+IF(B603=\"\",0,+B603)+IF(B605=\"\",0,+B605)","v":2},{"$f":"IF(B600=\"\",0,+B600)+IF(D603=\"\",0,+D603)+IF(D605=\"\",0,+D605)","v":7},{"$f":"L602-M602","v":-5},{"$f":"I602*3+K602","v":2},null,"Jérôme Cyganek (BEL)",3,1,1,1,4,7,-3,4]
[{"$f":"$C74","v":"Victor Dubuc (FRA)"},{"$f":"IF('Séries individuels'!D195=\"\",\"\",'Séries individuels'!D195)","v":1},"-",{"$f":"IF('Séries individuels'!F195=\"\",\"\",'Séries individuels'!F195)","v":1},{"$f":"$E74","v":"Charlotte Bouchez (BEL)"},null,{"$f":"A601","v":"Jérôme Cyganek (BEL)"},{"$f":"IF(B601=\"\",0,1)+IF(D602=\"\",0,1)+IF(D605=\"\",0,1)","v":3},{"$f":"IF(B601>D601,1,0)+IF(D602>B602,1,0)+IF(D605>B605,1,0)","v":1},{"$f":"IF(B601<D601,1,0)+IF(D602<B602,1,0)+IF(D605<B605,1,0)","v":1},{"$f":"IF(B601=\"\",0,IF(B601=D601,1,0))+IF(B602=\"\",0,IF(B602=D602,1,0))+IF(B605=\"\",0,IF(B605=D605,1,0))","v":1},{"$f":"IF(B601=\"\",0,+B601)+IF(D602=\"\",0,+D602)+IF(D605=\"\",0,+D605)","v":4},{"$f":"IF(D601=\"\",0,+D601)+IF(B602=\"\",0,+B602)+IF(B605=\"\",0,+B605)","v":7},{"$f":"L603-M603","v":-3},{"$f":"I603*3+K603","v":4},null,"Victor Dubuc (FRA)",3,0,1,2,2,7,-5,2]
[{"$f":"$E74","v":"Charlotte Bouchez (BEL)"},{"$f":"IF('Séries individuels'!D391=\"\",\"\",'Séries individuels'!D391)","v":0},"-",{"$f":"IF('Séries individuels'!F391=\"\",\"\",'Séries individuels'!F391)","v":4},{"$f":"$B74","v":"Matteo Cammarata (ITA)"},null,{"$f":"E601","v":"Charlotte Bouchez (BEL)"},{"$f":"IF(D601=\"\",0,1)+IF(D603=\"\",0,1)+IF(B604=\"\",0,1)","v":3},{"$f":"IF(D601>B601,1,0)+IF(D603>B603,1,0)+IF(B604>D604,1,0)","v":0},{"$f":"IF(D601<B601,1,0)+IF(D603<B603,1,0)+IF(B604<D604,1,0)","v":2},{"$f":"IF(B601=\"\",0,IF(B601=D601,1,0))+IF(B603=\"\",0,IF(B603=D603,1,0))+IF(B604=\"\",0,IF(B604=D604,1,0))","v":1},{"$f":"IF(D601=\"\",0,+D601)+IF(D603=\"\",0,+D603)+IF(B604=\"\",0,+B604)","v":2},{"$f":"IF(B601=\"\",0,+B601)+IF(B603=\"\",0,+B603)+IF(D604=\"\",0,+D604)","v":8},{"$f":"L604-M604","v":-6},{"$f":"I604*3+K604","v":1},null,"Charlotte Bouchez (BEL)",3,0,2,1,2,8,-6,1]
[{"$f":"$C74","v":"Victor Dubuc (FRA)"},{"$f":"IF('Séries individuels'!D392=\"\",\"\",'Séries individuels'!D392)","v":1},"-",{"$f":"IF('Séries individuels'!F392=\"\",\"\",'Séries individuels'!F392)","v":1},{"$f":"$D74","v":"Jérôme Cyganek (BEL)"},null,null,null,{"$f":"SUM(I601:I604)","v":4},{"$f":"SUM(J601:J604)","v":4},{"$f":"SUM(K601:K604)","v":4},{"$f":"SUM(L601:L604)","v":22},{"$f":"SUM(M601:M604)","v":22},{"$f":"SUM(N601:N604)","v":0}]
[]
["Group 2"]
[]
[{"$f":"$B75","v":"Lucas Pere (BEL)"},{"$f":"IF('Séries individuels'!D64=\"\",\"\",'Séries individuels'!D64)","v":5},"-",{"$f":"IF('Séries individuels'!F64=\"\",\"\",'Séries individuels'!F64)","v":0},{"$f":"$C75","v":"Lucie Baudour (BEL)"},null,null,"P","W","L","N","+","-","d","PTS",null,null,"P","W","L","N","+","-","d","PTS"]
[{"$f":"$D75","v":"Louis Fouetillou (FRA)"},{"$f":"IF('Séries individuels'!D65=\"\",\"\",'Séries individuels'!D65)","v":0},"-",{"$f":"IF('Séries individuels'!F65=\"\",\"\",'Séries individuels'!F65)","v":2},{"$f":"$E75","v":"Mattia Ferrante (ITA)"},null,{"$f":"A609","v":"Lucas Pere (BEL)"},{"$f":"IF(B609=\"\",0,1)+IF(B611=\"\",0,1)+IF(D613=\"\",0,1)","v":3},{"$f":"IF(B609>D609,1,0)+IF(B611>D611,1,0)+IF(D613>B613,1,0)","v":2},{"$f":"IF(B609<D609,1,0)+IF(B611<D611,1,0)+IF(D613<B613,1,0)","v":1},{"$f":"IF(B609=\"\",0,IF(B609=D609,1,0))+IF(B611=\"\",0,IF(B611=D611,1,0))+IF(B613=\"\",0,IF(B613=D613,1,0))","v":0},{"$f":"IF(B609=\"\",0,+B609)+IF(B611=\"\",0,+B611)+IF(D613=\"\",0,+D613)","v":7},{"$f":"IF(D609=\"\",0,+D609)+IF(D611=\"\",0,+D611)+IF(B613=\"\",0,+B613)","v":2},{"$f":"L610-M610","v":5},{"$f":"I610*3+K610","v":6},null,"Mattia Ferrante (ITA)",3,3,0,0,8,0,8,9]
[{"$f":"$B75","v":"Lucas Pere (BEL)"},{"$f":"IF('Séries individuels'!D196=\"\",\"\",'Séries individuels'!D196)","v":2},"-",{"$f":"IF('Séries individuels'!F196=\"\",\"\",'Séries individuels'!F196)","v":0},{"$f":"$D75","v":"Louis Fouetillou (FRA)"},null,{"$f":"E609","v":"Lucie Baudour (BEL)"},{"$f":"IF(D609=\"\",0,1)+IF(B612=\"\",0,1)+IF(B614=\"\",0,1)","v":3},{"$f":"IF(D609>B609,1,0)+IF(B612>D612,1,0)+IF(B614>D614,1,0)","v":0},{"$f":"IF(D609<B609,1,0)+IF(B612<D612,1,0)+IF(B614<D614,1,0)","v":3},{"$f":"IF(B609=\"\",0,IF(B609=D609,1,0))+IF(B612=\"\",0,IF(B612=D612,1,0))+IF(B614=\"\",0,IF(B614=D614,1,0))","v":0},{"$f":"IF(D609=\"\",0,+D609)+IF(B612=\"\",0,+B612)+IF(B614=\"\",0,+B614)","v":0},{"$f":"IF(B609=\"\",0,+B609)+IF(D612=\"\",0,+D612)+IF(D614=\"\",0,+D614)","v":10},{"$f":"L611-M611","v":-10},{"$f":"I611*3+K611","v":0},null,"Lucas Pere (BEL)",3,2,1,0,7,2,5,6]
[{"$f":"$C75","v":"Lucie Baudour (BEL)"},{"$f":"IF('Séries individuels'!D197=\"\",\"\",'Séries individuels'!D197)","v":0},"-",{"$f":"IF('Séries individuels'!F197=\"\",\"\",'Séries individuels'!F197)","v":4},{"$f":"$E75","v":"Mattia Ferrante (ITA)"},null,{"$f":"A610","v":"Louis Fouetillou (FRA)"},{"$f":"IF(B610=\"\",0,1)+IF(D611=\"\",0,1)+IF(D614=\"\",0,1)","v":3},{"$f":"IF(B610>D610,1,0)+IF(D611>B611,1,0)+IF(D614>B614,1,0)","v":1},{"$f":"IF(B610<D610,1,0)+IF(D611<B611,1,0)+IF(D614<B614,1,0)","v":2},{"$f":"IF(B610=\"\",0,IF(B610=D610,1,0))+IF(B611=\"\",0,IF(B611=D611,1,0))+IF(B614=\"\",0,IF(B614=D614,1,0))","v":0},{"$f":"IF(B610=\"\",0,+B610)+IF(D611=\"\",0,+D611)+IF(D614=\"\",0,+D614)","v":1},{"$f":"IF(D610=\"\",0,+D610)+IF(B611=\"\",0,+B611)+IF(B614=\"\",0,+B614)","v":4},{"$f":"L612-M612","v":-3},{"$f":"I612*3+K612","v":3},null,"Louis Fouetillou (FRA)",3,1,2,0,1,4,-3,3]
[{"$f":"$E75","v":"Mattia Ferrante (ITA)"},{"$f":"IF('Séries individuels'!D393=\"\",\"\",'Séries individuels'!D393)","v":2},"-",{"$f":"IF('Séries individuels'!F393=\"\",\"\",'Séries individuels'!F393)","v":0},{"$f":"$B75","v":"Lucas Pere (BEL)"},null,{"$f":"E610","v":"Mattia Ferrante (ITA)"},{"$f":"IF(D610=\"\",0,1)+IF(D612=\"\",0,1)+IF(B613=\"\",0,1)","v":3},{"$f":"IF(D610>B610,1,0)+IF(D612>B612,1,0)+IF(B613>D613,1,0)","v":3},{"$f":"IF(D610<B610,1,0)+IF(D612<B612,1,0)+IF(B613<D613,1,0)","v":0},{"$f":"IF(B610=\"\",0,IF(B610=D610,1,0))+IF(B612=\"\",0,IF(B612=D612,1,0))+IF(B613=\"\",0,IF(B613=D613,1,0))","v":0},{"$f":"IF(D610=\"\",0,+D610)+IF(D612=\"\",0,+D612)+IF(B613=\"\",0,+B613)","v":8},{"$f":"IF(B610=\"\",0,+B610)+IF(B612=\"\",0,+B612)+IF(D613=\"\",0,+D613)","v":0},{"$f":"L613-M613","v":8},{"$f":"I613*3+K613","v":9},null,"Lucie Baudour (BEL)",3,0,3,0,0,10,-10,0]
[{"$f":"$C75","v":"Lucie Baudour (BEL)"},{"$f":"IF('Séries individuels'!D394=\"\",\"\",'Séries individuels'!D394)","v":0},"-",{"$f":"IF('Séries individuels'!F394=\"\",\"\",'Séries individuels'!F394)","v":1},{"$f":"$D75","v":"Louis Fouetillou (FRA)"},null,null,null,{"$f":"SUM(I610:I613)","v":6},{"$f":"SUM(J610:J613)","v":6},{"$f":"SUM(K610:K613)","v":0},{"$f":"SUM(L610:L613)","v":16},{"$f":"SUM(M610:M613)","v":16},{"$f":"SUM(N610:N613)","v":0}]
[]
["Group 3"]
[]
[{"$f":"$B76","v":"Basile Magermans (BEL)"},{"$f":"IF('Séries individuels'!D123=\"\",\"\",'Séries individuels'!D123)","v":5},"-",{"$f":"IF('Séries individuels'!F123=\"\",\"\",'Séries individuels'!F123)","v":0},{"$f":"$C76","v":"Léa Despretz (BEL)"},null,null,"P","W","L","N","+","-","d","PTS",null,null,"P","W","L","N","+","-","d","PTS"]
[{"$f":"$D76","v":"Diogo Pereira (POR)"},{"$f":"IF('Séries individuels'!D124=\"\",\"\",'Séries individuels'!D124)","v":2},"-",{"$f":"IF('Séries individuels'!F124=\"\",\"\",'Séries individuels'!F124)","v":0},{"$f":"$E76","v":"Carlos Pinto (ESP)"},null,{"$f":"A618","v":"Basile Magermans (BEL)"},{"$f":"IF(B618=\"\",0,1)+IF(B620=\"\",0,1)+IF(D622=\"\",0,1)","v":3},{"$f":"IF(B618>D618,1,0)+IF(B620>D620,1,0)+IF(D622>B622,1,0)","v":3},{"$f":"IF(B618<D618,1,0)+IF(B620<D620,1,0)+IF(D622<B622,1,0)","v":0},{"$f":"IF(B618=\"\",0,IF(B618=D618,1,0))+IF(B620=\"\",0,IF(B620=D620,1,0))+IF(B622=\"\",0,IF(B622=D622,1,0))","v":0},{"$f":"IF(B618=\"\",0,+B618)+IF(B620=\"\",0,+B620)+IF(D622=\"\",0,+D622)","v":11},{"$f":"IF(D618=\"\",0,+D618)+IF(D620=\"\",0,+D620)+IF(B622=\"\",0,+B622)","v":1},{"$f":"L619-M619","v":10},{"$f":"I619*3+K619","v":9},null,"Basile Magermans (BEL)",3,3,0,0,11,1,10,9]
[{"$f":"$B76","v":"Basile Magermans (BEL)"},{"$f":"IF('Séries individuels'!D261=\"\",\"\",'Séries individuels'!D261)","v":4},"-",{"$f":"IF('Séries individuels'!F261=\"\",\"\",'Séries individuels'!F261)","v":1},{"$f":"$D76","v":"Diogo Pereira (POR)"},null,{"$f":"E618","v":"Léa Despretz (BEL)"},{"$f":"IF(D618=\"\",0,1)+IF(B621=\"\",0,1)+IF(B623=\"\",0,1)","v":3},{"$f":"IF(D618>B618,1,0)+IF(B621>D621,1,0)+IF(B623>D623,1,0)","v":0},{"$f":"IF(D618<B618,1,0)+IF(B621<D621,1,0)+IF(B623<D623,1,0)","v":3},{"$f":"IF(B618=\"\",0,IF(B618=D618,1,0))+IF(B621=\"\",0,IF(B621=D621,1,0))+IF(B623=\"\",0,IF(B623=D623,1,0))","v":0},{"$f":"IF(D618=\"\",0,+D618)+IF(B621=\"\",0,+B621)+IF(B623=\"\",0,+B623)","v":0},{"$f":"IF(B618=\"\",0,+B618)+IF(D621=\"\",0,+D621)+IF(D623=\"\",0,+D623)","v":13},{"$f":"L620-M620","v":-13},{"$f":"I620*3+K620","v":0},null,"Diogo Pereira (POR)",3,2,1,0,6,4,2,6]
[{"$f":"$C76","v":"Léa Despretz (BEL)"},{"$f":"IF('Séries individuels'!D262=\"\",\"\",'Séries individuels'!D262)","v":0},"-",{"$f":"IF('Séries individuels'!F262=\"\",\"\",'Séries individuels'!F262)","v":5},{"$f":"$E76","v":"Carlos Pinto (ESP)"},null,{"$f":"A619","v":"Diogo Pereira (POR)"},{"$f":"IF(B619=\"\",0,1)+IF(D620=\"\",0,1)+IF(D623=\"\",0,1)","v":3},{"$f":"IF(B619>D619,1,0)+IF(D620>B620,1,0)+IF(D623>B623,1,0)","v":2},{"$f":"IF(B619<D619,1,0)+IF(D620<B620,1,0)+IF(D623<B623,1,0)","v":1},{"$f":"IF(B619=\"\",0,IF(B619=D619,1,0))+IF(B620=\"\",0,IF(B620=D620,1,0))+IF(B623=\"\",0,IF(B623=D623,1,0))","v":0},{"$f":"IF(B619=\"\",0,+B619)+IF(D620=\"\",0,+D620)+IF(D623=\"\",0,+D623)","v":6},{"$f":"IF(D619=\"\",0,+D619)+IF(B620=\"\",0,+B620)+IF(B623=\"\",0,+B623)","v":4},{"$f":"L621-M621","v":2},{"$f":"I621*3+K621","v":6},null,"Carlos Pinto (ESP)",3,1,2,0,5,4,1,3]
[{"$f":"$E76","v":"Carlos Pinto (ESP)"},{"$f":"IF('Séries individuels'!D395=\"\",\"\",'Séries individuels'!D395)","v":0},"-",{"$f":"IF('Séries individuels'!F395=\"\",\"\",'Séries individuels'!F395)","v":2},{"$f":"$B76","v":"Basile Magermans (BEL)"},null,{"$f":"E619","v":"Carlos Pinto (ESP)"},{"$f":"IF(D619=\"\",0,1)+IF(D621=\"\",0,1)+IF(B622=\"\",0,1)","v":3},{"$f":"IF(D619>B619,1,0)+IF(D621>B621,1,0)+IF(B622>D622,1,0)","v":1},{"$f":"IF(D619<B619,1,0)+IF(D621<B621,1,0)+IF(B622<D622,1,0)","v":2},{"$f":"IF(B619=\"\",0,IF(B619=D619,1,0))+IF(B621=\"\",0,IF(B621=D621,1,0))+IF(B622=\"\",0,IF(B622=D622,1,0))","v":0},{"$f":"IF(D619=\"\",0,+D619)+IF(D621=\"\",0,+D621)+IF(B622=\"\",0,+B622)","v":5},{"$f":"IF(B619=\"\",0,+B619)+IF(B621=\"\",0,+B621)+IF(D622=\"\",0,+D622)","v":4},{"$f":"L622-M622","v":1},{"$f":"I622*3+K622","v":3},null,"Léa Despretz (BEL)",3,0,3,0,0,13,-13,0]
[{"$f":"$C76","v":"Léa Despretz (BEL)"},{"$f":"IF('Séries individuels'!D396=\"\",\"\",'Séries individuels'!D396)","v":0},"-",{"$f":"IF('Séries individuels'!F396=\"\",\"\",'Séries individuels'!F396)","v":3},{"$f":"$D76","v":"Diogo Pereira (POR)"},null,null,null,{"$f":"SUM(I619:I622)","v":6},{"$f":"SUM(J619:J622)","v":6},{"$f":"SUM(K619:K622)","v":0},{"$f":"SUM(L619:L622)","v":22},{"$f":"SUM(M619:M622)","v":22},{"$f":"SUM(N619:N622)","v":0}]
[]
["Group 4"]
[null,{"$f":"IF('Séries individuels'!D131=\"\",\"\",'Séries individuels'!D131)","v":""},null,{"$f":"IF('Séries individuels'!F131=\"\",\"\",'Séries individuels'!F131)","v":""}]
[{"$f":"$B77","v":"Riccardo Natoli (ITA)"},{"$f":"IF('Séries individuels'!D125=\"\",\"\",'Séries individuels'!D125)","v":3},"-",{"$f":"IF('Séries individuels'!F125=\"\",\"\",'Séries individuels'!F125)","v":0},{"$f":"$C77","v":"Jann Segers (BEL)"},null,null,"P","W","L","N","+","-","d","PTS",null,null,"P","W","L","N","+","-","d","PTS"]
[{"$f":"$D77","v":"Conor Atkin (ENG)"},{"$f":"IF('Séries individuels'!D126=\"\",\"\",'Séries individuels'!D126)","v":0},"-",{"$f":"IF('Séries individuels'!F126=\"\",\"\",'Séries individuels'!F126)","v":1},{"$f":"$E77","v":"Quentin Ausset (FRA)"},null,{"$f":"A627","v":"Riccardo Natoli (ITA)"},{"$f":"IF(B627=\"\",0,1)+IF(B629=\"\",0,1)+IF(D631=\"\",0,1)","v":3},{"$f":"IF(B627>D627,1,0)+IF(B629>D629,1,0)+IF(D631>B631,1,0)","v":2},{"$f":"IF(B627<D627,1,0)+IF(B629<D629,1,0)+IF(D631<B631,1,0)","v":0},{"$f":"IF(B627=\"\",0,IF(B627=D627,1,0))+IF(B629=\"\",0,IF(B629=D629,1,0))+IF(B631=\"\",0,IF(B631=D631,1,0))","v":1},{"$f":"IF(B627=\"\",0,+B627)+IF(B629=\"\",0,+B629)+IF(D631=\"\",0,+D631)","v":10},{"$f":"IF(D627=\"\",0,+D627)+IF(D629=\"\",0,+D629)+IF(B631=\"\",0,+B631)","v":2},{"$f":"L628-M628","v":8},{"$f":"I628*3+K628","v":7},null,"Riccardo Natoli (ITA)",3,2,0,1,10,2,8,7]
[{"$f":"$B77","v":"Riccardo Natoli (ITA)"},{"$f":"IF('Séries individuels'!D263=\"\",\"\",'Séries individuels'!D263)","v":5},"-",{"$f":"IF('Séries individuels'!F263=\"\",\"\",'Séries individuels'!F263)","v":0},{"$f":"$D77","v":"Conor Atkin (ENG)"},null,{"$f":"E627","v":"Jann Segers (BEL)"},{"$f":"IF(D627=\"\",0,1)+IF(B630=\"\",0,1)+IF(B632=\"\",0,1)","v":3},{"$f":"IF(D627>B627,1,0)+IF(B630>D630,1,0)+IF(B632>D632,1,0)","v":1},{"$f":"IF(D627<B627,1,0)+IF(B630<D630,1,0)+IF(B632<D632,1,0)","v":2},{"$f":"IF(B627=\"\",0,IF(B627=D627,1,0))+IF(B630=\"\",0,IF(B630=D630,1,0))+IF(B632=\"\",0,IF(B632=D632,1,0))","v":0},{"$f":"IF(D627=\"\",0,+D627)+IF(B630=\"\",0,+B630)+IF(B632=\"\",0,+B632)","v":4},{"$f":"IF(B627=\"\",0,+B627)+IF(D630=\"\",0,+D630)+IF(D632=\"\",0,+D632)","v":5},{"$f":"L629-M629","v":-1},{"$f":"I629*3+K629","v":3},null,"Quentin Ausset (FRA)",3,2,0,1,5,2,3,7]
[{"$f":"$C77","v":"Jann Segers (BEL)"},{"$f":"IF('Séries individuels'!D264=\"\",\"\",'Séries individuels'!D264)","v":0},"-",{"$f":"IF('Séries individuels'!F264=\"\",\"\",'Séries individuels'!F264)","v":2},{"$f":"$E77","v":"Quentin Ausset (FRA)"},null,{"$f":"A628","v":"Conor Atkin (ENG)"},{"$f":"IF(B628=\"\",0,1)+IF(D629=\"\",0,1)+IF(D632=\"\",0,1)","v":3},{"$f":"IF(B628>D628,1,0)+IF(D629>B629,1,0)+IF(D632>B632,1,0)","v":0},{"$f":"IF(B628<D628,1,0)+IF(D629<B629,1,0)+IF(D632<B632,1,0)","v":3},{"$f":"IF(B628=\"\",0,IF(B628=D628,1,0))+IF(B629=\"\",0,IF(B629=D629,1,0))+IF(B632=\"\",0,IF(B632=D632,1,0))","v":0},{"$f":"IF(B628=\"\",0,+B628)+IF(D629=\"\",0,+D629)+IF(D632=\"\",0,+D632)","v":0},{"$f":"IF(D628=\"\",0,+D628)+IF(B629=\"\",0,+B629)+IF(B632=\"\",0,+B632)","v":10},{"$f":"L630-M630","v":-10},{"$f":"I630*3+K630","v":0},null,"Jann Segers (BEL)",3,1,2,0,4,5,-1,3]
[{"$f":"$E77","v":"Quentin Ausset (FRA)"},{"$f":"IF('Séries individuels'!D397=\"\",\"\",'Séries individuels'!D397)","v":2},"-",{"$f":"IF('Séries individuels'!F397=\"\",\"\",'Séries individuels'!F397)","v":2},{"$f":"$B77","v":"Riccardo Natoli (ITA)"},null,{"$f":"E628","v":"Quentin Ausset (FRA)"},{"$f":"IF(D628=\"\",0,1)+IF(D630=\"\",0,1)+IF(B631=\"\",0,1)","v":3},{"$f":"IF(D628>B628,1,0)+IF(D630>B630,1,0)+IF(B631>D631,1,0)","v":2},{"$f":"IF(D628<B628,1,0)+IF(D630<B630,1,0)+IF(B631<D631,1,0)","v":0},{"$f":"IF(B628=\"\",0,IF(B628=D628,1,0))+IF(B630=\"\",0,IF(B630=D630,1,0))+IF(B631=\"\",0,IF(B631=D631,1,0))","v":1},{"$f":"IF(D628=\"\",0,+D628)+IF(D630=\"\",0,+D630)+IF(B631=\"\",0,+B631)","v":5},{"$f":"IF(B628=\"\",0,+B628)+IF(B630=\"\",0,+B630)+IF(D631=\"\",0,+D631)","v":2},{"$f":"L631-M631","v":3},{"$f":"I631*3+K631","v":7},null,"Conor Atkin (ENG)",3,0,3,0,0,10,-10,0]
[{"$f":"$C77","v":"Jann Segers (BEL)"},{"$f":"IF('Séries individuels'!D398=\"\",\"\",'Séries individuels'!D398)","v":4},"-",{"$f":"IF('Séries individuels'!F398=\"\",\"\",'Séries individuels'!F398)","v":0},{"$f":"$D77","v":"Conor Atkin (ENG)"},null,null,null,{"$f":"SUM(I628:I631)","v":5},{"$f":"SUM(J628:J631)","v":5},{"$f":"SUM(K628:K631)","v":2},{"$f":"SUM(L628:L631)","v":19},{"$f":"SUM(M628:M631)","v":19},{"$f":"SUM(N628:N631)","v":0}]
[]
["Group 5"]
[]
[{"$f":"$B78","v":"Francesco Tozzi (ITA)"},{"$f":"IF('Séries individuels'!D127=\"\",\"\",'Séries individuels'!D127)","v":3},"-",{"$f":"IF('Séries individuels'!F127=\"\",\"\",'Séries individuels'!F127)","v":0},{"$f":"$C78","v":"Gabriel Lombardi (AUS)"},null,null,"P","W","L","N","+","-","d","PTS",null,null,"P","W","L","N","+","-","d","PTS"]
[{"$f":"$D78","v":"Noah Denne (BEL)"},{"$f":"IF('Séries individuels'!D128=\"\",\"\",'Séries individuels'!D128)","v":0},"-",{"$f":"IF('Séries individuels'!F128=\"\",\"\",'Séries individuels'!F128)","v":1},{"$f":"$E78","v":"Jesús Maireles (ESP)"},null,{"$f":"A636","v":"Francesco Tozzi (ITA)"},{"$f":"IF(B636=\"\",0,1)+IF(B638=\"\",0,1)+IF(D640=\"\",0,1)","v":3},{"$f":"IF(B636>D636,1,0)+IF(B638>D638,1,0)+IF(D640>B640,1,0)","v":3},{"$f":"IF(B636<D636,1,0)+IF(B638<D638,1,0)+IF(D640<B640,1,0)","v":0},{"$f":"IF(B636=\"\",0,IF(B636=D636,1,0))+IF(B638=\"\",0,IF(B638=D638,1,0))+IF(B640=\"\",0,IF(B640=D640,1,0))","v":0},{"$f":"IF(B636=\"\",0,+B636)+IF(B638=\"\",0,+B638)+IF(D640=\"\",0,+D640)","v":11},{"$f":"IF(D636=\"\",0,+D636)+IF(D638=\"\",0,+D638)+IF(B640=\"\",0,+B640)","v":0},{"$f":"L637-M637","v":11},{"$f":"I637*3+K637","v":9},null,"Francesco Tozzi (ITA)",3,3,0,0,11,0,11,9]
[{"$f":"$B78","v":"Francesco Tozzi (ITA)"},{"$f":"IF('Séries individuels'!D326=\"\",\"\",'Séries individuels'!D326)","v":5},"-",{"$f":"IF('Séries individuels'!F326=\"\",\"\",'Séries individuels'!F326)","v":0},{"$f":"$D78","v":"Noah Denne (BEL)"},null,{"$f":"E636","v":"Gabriel Lombardi (AUS)"},{"$f":"IF(D636=\"\",0,1)+IF(B639=\"\",0,1)+IF(B641=\"\",0,1)","v":3},{"$f":"IF(D636>B636,1,0)+IF(B639>D639,1,0)+IF(B641>D641,1,0)","v":0},{"$f":"IF(D636<B636,1,0)+IF(B639<D639,1,0)+IF(B641<D641,1,0)","v":3},{"$f":"IF(B636=\"\",0,IF(B636=D636,1,0))+IF(B639=\"\",0,IF(B639=D639,1,0))+IF(B641=\"\",0,IF(B641=D641,1,0))","v":0},{"$f":"IF(D636=\"\",0,+D636)+IF(B639=\"\",0,+B639)+IF(B641=\"\",0,+B641)","v":0},{"$f":"IF(B636=\"\",0,+B636)+IF(D639=\"\",0,+D639)+IF(D641=\"\",0,+D641)","v":9},{"$f":"L638-M638","v":-9},{"$f":"I638*3+K638","v":0},null,"Jesús Maireles (ESP)",3,2,1,0,4,3,1,6]
[{"$f":"$C78","v":"Gabriel Lombardi (AUS)"},{"$f":"IF('Séries individuels'!D327=\"\",\"\",'Séries individuels'!D327)","v":0},"-",{"$f":"IF('Séries individuels'!F327=\"\",\"\",'Séries individuels'!F327)","v":3},{"$f":"$E78","v":"Jesús Maireles (ESP)"},null,{"$f":"A637","v":"Noah Denne (BEL)"},{"$f":"IF(B637=\"\",0,1)+IF(D638=\"\",0,1)+IF(D641=\"\",0,1)","v":3},{"$f":"IF(B637>D637,1,0)+IF(D638>B638,1,0)+IF(D641>B641,1,0)","v":1},{"$f":"IF(B637<D637,1,0)+IF(D638<B638,1,0)+IF(D641<B641,1,0)","v":2},{"$f":"IF(B637=\"\",0,IF(B637=D637,1,0))+IF(B638=\"\",0,IF(B638=D638,1,0))+IF(B641=\"\",0,IF(B641=D641,1,0))","v":0},{"$f":"IF(B637=\"\",0,+B637)+IF(D638=\"\",0,+D638)+IF(D641=\"\",0,+D641)","v":3},{"$f":"IF(D637=\"\",0,+D637)+IF(B638=\"\",0,+B638)+IF(B641=\"\",0,+B641)","v":6},{"$f":"L639-M639","v":-3},{"$f":"I639*3+K639","v":3},null,"Noah Denne (BEL)",3,1,2,0,3,6,-3,3]
[{"$f":"$E78","v":"Jesús Maireles (ESP)"},{"$f":"IF('Séries individuels'!D462=\"\",\"\",'Séries individuels'!D462)","v":0},"-",{"$f":"IF('Séries individuels'!F462=\"\",\"\",'Séries individuels'!F462)","v":3},{"$f":"$B78","v":"Francesco Tozzi (ITA)"},null,{"$f":"E637","v":"Jesús Maireles (ESP)"},{"$f":"IF(D637=\"\",0,1)+IF(D639=\"\",0,1)+IF(B640=\"\",0,1)","v":3},{"$f":"IF(D637>B637,1,0)+IF(D639>B639,1,0)+IF(B640>D640,1,0)","v":2},{"$f":"IF(D637<B637,1,0)+IF(D639<B639,1,0)+IF(B640<D640,1,0)","v":1},{"$f":"IF(B637=\"\",0,IF(B637=D637,1,0))+IF(B639=\"\",0,IF(B639=D639,1,0))+IF(B640=\"\",0,IF(B640=D640,1,0))","v":0},{"$f":"IF(D637=\"\",0,+D637)+IF(D639=\"\",0,+D639)+IF(B640=\"\",0,+B640)","v":4},{"$f":"IF(B637=\"\",0,+B637)+IF(B639=\"\",0,+B639)+IF(D640=\"\",0,+D640)","v":3},{"$f":"L640-M640","v":1},{"$f":"I640*3+K640","v":6},null,"Gabriel Lombardi (AUS)",3,0,3,0,0,9,-9,0]
[{"$f":"$C78","v":"Gabriel Lombardi (AUS)"},{"$f":"IF('Séries individuels'!D463=\"\",\"\",'Séries individuels'!D463)","v":0},"-",{"$f":"IF('Séries individuels'!F463=\"\",\"\",'Séries individuels'!F463)","v":3},{"$f":"$D78","v":"Noah Denne (BEL)"},null,null,null,{"$f":"SUM(I637:I640)","v":6},{"$f":"SUM(J637:J640)","v":6},{"$f":"SUM(K637:K640)","v":0},{"$f":"SUM(L637:L640)","v":18},{"$f":"SUM(M637:M640)","v":18},{"$f":"SUM(N637:N640)","v":0}]
[]
["Group 6"]
[]
[{"$f":"$B79","v":"Giorgio Giudice (ITA)"},{"$f":"IF('Séries individuels'!D129=\"\",\"\",'Séries individuels'!D129)","v":1},"-",{"$f":"IF('Séries individuels'!F129=\"\",\"\",'Séries individuels'!F129)","v":0},{"$f":"$C79","v":"Joseph Agius (MLT)"},null,null,"P","W","L","N","+","-","d","PTS",null,null,"P","W","L","N","+","-","d","PTS"]
[{"$f":"$D79","v":"Mark Offmann (FRA)"},{"$f":"IF('Séries individuels'!D130=\"\",\"\",'Séries individuels'!D130)","v":3},"-",{"$f":"IF('Séries individuels'!F130=\"\",\"\",'Séries individuels'!F130)","v":2},{"$f":"$E79","v":"Alex Genart (BEL)"},null,{"$f":"A645","v":"Giorgio Giudice (ITA)"},{"$f":"IF(B645=\"\",0,1)+IF(B647=\"\",0,1)+IF(D649=\"\",0,1)","v":3},{"$f":"IF(B645>D645,1,0)+IF(B647>D647,1,0)+IF(D649>B649,1,0)","v":3},{"$f":"IF(B645<D645,1,0)+IF(B647<D647,1,0)+IF(D649<B649,1,0)","v":0},{"$f":"IF(B645=\"\",0,IF(B645=D645,1,0))+IF(B647=\"\",0,IF(B647=D647,1,0))+IF(B649=\"\",0,IF(B649=D649,1,0))","v":0},{"$f":"IF(B645=\"\",0,+B645)+IF(B647=\"\",0,+B647)+IF(D649=\"\",0,+D649)","v":10},{"$f":"IF(D645=\"\",0,+D645)+IF(D647=\"\",0,+D647)+IF(B649=\"\",0,+B649)","v":0},{"$f":"L646-M646","v":10},{"$f":"I646*3+K646","v":9},null,"Giorgio Giudice (ITA)",3,3,0,0,10,0,10,9]
[{"$f":"$B79","v":"Giorgio Giudice (ITA)"},{"$f":"IF('Séries individuels'!D328=\"\",\"\",'Séries individuels'!D328)","v":5},"-",{"$f":"IF('Séries individuels'!F328=\"\",\"\",'Séries individuels'!F328)","v":0},{"$f":"$D79","v":"Mark Offmann (FRA)"},null,{"$f":"E645","v":"Joseph Agius (MLT)"},{"$f":"IF(D645=\"\",0,1)+IF(B648=\"\",0,1)+IF(B650=\"\",0,1)","v":3},{"$f":"IF(D645>B645,1,0)+IF(B648>D648,1,0)+IF(B650>D650,1,0)","v":0},{"$f":"IF(D645<B645,1,0)+IF(B648<D648,1,0)+IF(B650<D650,1,0)","v":2},{"$f":"IF(B645=\"\",0,IF(B645=D645,1,0))+IF(B648=\"\",0,IF(B648=D648,1,0))+IF(B650=\"\",0,IF(B650=D650,1,0))","v":1},{"$f":"IF(D645=\"\",0,+D645)+IF(B648=\"\",0,+B648)+IF(B650=\"\",0,+B650)","v":3},{"$f":"IF(B645=\"\",0,+B645)+IF(D648=\"\",0,+D648)+IF(D650=\"\",0,+D650)","v":6},{"$f":"L647-M647","v":-3},{"$f":"I647*3+K647","v":1},null,"Mark Offmann (FRA)",3,1,1,1,4,8,-4,4]
[{"$f":"$C79","v":"Joseph Agius (MLT)"},{"$f":"IF('Séries individuels'!D329=\"\",\"\",'Séries individuels'!D329)","v":2},"-",{"$f":"IF('Séries individuels'!F329=\"\",\"\",'Séries individuels'!F329)","v":4},{"$f":"$E79","v":"Alex Genart (BEL)"},null,{"$f":"A646","v":"Mark Offmann (FRA)"},{"$f":"IF(B646=\"\",0,1)+IF(D647=\"\",0,1)+IF(D650=\"\",0,1)","v":3},{"$f":"IF(B646>D646,1,0)+IF(D647>B647,1,0)+IF(D650>B650,1,0)","v":1},{"$f":"IF(B646<D646,1,0)+IF(D647<B647,1,0)+IF(D650<B650,1,0)","v":1},{"$f":"IF(B646=\"\",0,IF(B646=D646,1,0))+IF(B647=\"\",0,IF(B647=D647,1,0))+IF(B650=\"\",0,IF(B650=D650,1,0))","v":1},{"$f":"IF(B646=\"\",0,+B646)+IF(D647=\"\",0,+D647)+IF(D650=\"\",0,+D650)","v":4},{"$f":"IF(D646=\"\",0,+D646)+IF(B647=\"\",0,+B647)+IF(B650=\"\",0,+B650)","v":8},{"$f":"L648-M648","v":-4},{"$f":"I648*3+K648","v":4},null,"Alex Genart (BEL)",3,1,2,0,6,9,-3,3]
[{"$f":"$E79","v":"Alex Genart (BEL)"},{"$f":"IF('Séries individuels'!D464=\"\",\"\",'Séries individuels'!D464)","v":0},"-",{"$f":"IF('Séries individuels'!F464=\"\",\"\",'Séries individuels'!F464)","v":4},{"$f":"$B79","v":"Giorgio Giudice (ITA)"},null,{"$f":"E646","v":"Alex Genart (BEL)"},{"$f":"IF(D646=\"\",0,1)+IF(D648=\"\",0,1)+IF(B649=\"\",0,1)","v":3},{"$f":"IF(D646>B646,1,0)+IF(D648>B648,1,0)+IF(B649>D649,1,0)","v":1},{"$f":"IF(D646<B646,1,0)+IF(D648<B648,1,0)+IF(B649<D649,1,0)","v":2},{"$f":"IF(B646=\"\",0,IF(B646=D646,1,0))+IF(B648=\"\",0,IF(B648=D648,1,0))+IF(B649=\"\",0,IF(B649=D649,1,0))","v":0},{"$f":"IF(D646=\"\",0,+D646)+IF(D648=\"\",0,+D648)+IF(B649=\"\",0,+B649)","v":6},{"$f":"IF(B646=\"\",0,+B646)+IF(B648=\"\",0,+B648)+IF(D649=\"\",0,+D649)","v":9},{"$f":"L649-M649","v":-3},{"$f":"I649*3+K649","v":3},null,"Joseph Agius (MLT)",3,0,2,1,3,6,-3,1]
[{"$f":"$C79","v":"Joseph Agius (MLT)"},{"$f":"IF('Séries individuels'!D465=\"\",\"\",'Séries individuels'!D465)","v":1},"-",{"$f":"IF('Séries individuels'!F465=\"\",\"\",'Séries individuels'!F465)","v":1},{"$f":"$D79","v":"Mark Offmann (FRA)"},null,null,null,{"$f":"SUM(I646:I649)","v":5},{"$f":"SUM(J646:J649)","v":5},{"$f":"SUM(K646:K649)","v":2},{"$f":"SUM(L646:L649)","v":23},{"$f":"SUM(M646:M649)","v":23},{"$f":"SUM(N646:N649)","v":0}]
[]
["Group 7"]
[]
[{"$f":"$B80","v":"Joshua Foreman (ENG)"},{"$f":"IF('Séries individuels'!D192=\"\",\"\",'Séries individuels'!D192)","v":0},"-",{"$f":"IF('Séries individuels'!F192=\"\",\"\",'Séries individuels'!F192)","v":3},{"$f":"$C80","v":"Kristian Silagiev (ESP)"},null,null,"P","W","L","N","+","-","d","PTS",null,null,"P","W","L","N","+","-","d","PTS"]
[{"$f":"$D80","v":"Cristian Fricano  (ITA)"},{"$f":"IF('Séries individuels'!D193=\"\",\"\",'Séries individuels'!D193)","v":5},"-",{"$f":"IF('Séries individuels'!F193=\"\",\"\",'Séries individuels'!F193)","v":0},{"$f":"$E80","v":"Aurélien Feye (BEL)"},null,{"$f":"A654","v":"Joshua Foreman (ENG)"},{"$f":"IF(B654=\"\",0,1)+IF(B656=\"\",0,1)+IF(D658=\"\",0,1)","v":3},{"$f":"IF(B654>D654,1,0)+IF(B656>D656,1,0)+IF(D658>B658,1,0)","v":1},{"$f":"IF(B654<D654,1,0)+IF(B656<D656,1,0)+IF(D658<B658,1,0)","v":2},{"$f":"IF(B654=\"\",0,IF(B654=D654,1,0))+IF(B656=\"\",0,IF(B656=D656,1,0))+IF(B658=\"\",0,IF(B658=D658,1,0))","v":0},{"$f":"IF(B654=\"\",0,+B654)+IF(B656=\"\",0,+B656)+IF(D658=\"\",0,+D658)","v":3},{"$f":"IF(D654=\"\",0,+D654)+IF(D656=\"\",0,+D656)+IF(B658=\"\",0,+B658)","v":6},{"$f":"L655-M655","v":-3},{"$f":"I655*3+K655","v":3},null,"Cristian Fricano  (ITA)",3,3,0,0,10,3,7,9]
[{"$f":"$B80","v":"Joshua Foreman (ENG)"},{"$f":"IF('Séries individuels'!D330=\"\",\"\",'Séries individuels'!D330)","v":2},"-",{"$f":"IF('Séries individuels'!F330=\"\",\"\",'Séries individuels'!F330)","v":3},{"$f":"$D80","v":"Cristian Fricano  (ITA)"},null,{"$f":"E654","v":"Kristian Silagiev (ESP)"},{"$f":"IF(D654=\"\",0,1)+IF(B657=\"\",0,1)+IF(B659=\"\",0,1)","v":3},{"$f":"IF(D654>B654,1,0)+IF(B657>D657,1,0)+IF(B659>D659,1,0)","v":2},{"$f":"IF(D654<B654,1,0)+IF(B657<D657,1,0)+IF(B659<D659,1,0)","v":1},{"$f":"IF(B654=\"\",0,IF(B654=D654,1,0))+IF(B657=\"\",0,IF(B657=D657,1,0))+IF(B659=\"\",0,IF(B659=D659,1,0))","v":0},{"$f":"IF(D654=\"\",0,+D654)+IF(B657=\"\",0,+B657)+IF(B659=\"\",0,+B659)","v":8},{"$f":"IF(B654=\"\",0,+B654)+IF(D657=\"\",0,+D657)+IF(D659=\"\",0,+D659)","v":2},{"$f":"L656-M656","v":6},{"$f":"I656*3+K656","v":6},null,"Kristian Silagiev (ESP)",3,2,1,0,8,2,6,6]
[{"$f":"$C80","v":"Kristian Silagiev (ESP)"},{"$f":"IF('Séries individuels'!D331=\"\",\"\",'Séries individuels'!D331)","v":4},"-",{"$f":"IF('Séries individuels'!F331=\"\",\"\",'Séries individuels'!F331)","v":0},{"$f":"$E80","v":"Aurélien Feye (BEL)"},null,{"$f":"A655","v":"Cristian Fricano  (ITA)"},{"$f":"IF(B655=\"\",0,1)+IF(D656=\"\",0,1)+IF(D659=\"\",0,1)","v":3},{"$f":"IF(B655>D655,1,0)+IF(D656>B656,1,0)+IF(D659>B659,1,0)","v":3},{"$f":"IF(B655<D655,1,0)+IF(D656<B656,1,0)+IF(D659<B659,1,0)","v":0},{"$f":"IF(B655=\"\",0,IF(B655=D655,1,0))+IF(B656=\"\",0,IF(B656=D656,1,0))+IF(B659=\"\",0,IF(B659=D659,1,0))","v":0},{"$f":"IF(B655=\"\",0,+B655)+IF(D656=\"\",0,+D656)+IF(D659=\"\",0,+D659)","v":10},{"$f":"IF(D655=\"\",0,+D655)+IF(B656=\"\",0,+B656)+IF(B659=\"\",0,+B659)","v":3},{"$f":"L657-M657","v":7},{"$f":"I657*3+K657","v":9},null,"Joshua Foreman (ENG)",3,1,2,0,3,6,-3,3]
[{"$f":"$E80","v":"Aurélien Feye (BEL)"},{"$f":"IF('Séries individuels'!D466=\"\",\"\",'Séries individuels'!D466)","v":0},"-",{"$f":"IF('Séries individuels'!F466=\"\",\"\",'Séries individuels'!F466)","v":1},{"$f":"$B80","v":"Joshua Foreman (ENG)"},null,{"$f":"E655","v":"Aurélien Feye (BEL)"},{"$f":"IF(D655=\"\",0,1)+IF(D657=\"\",0,1)+IF(B658=\"\",0,1)","v":3},{"$f":"IF(D655>B655,1,0)+IF(D657>B657,1,0)+IF(B658>D658,1,0)","v":0},{"$f":"IF(D655<B655,1,0)+IF(D657<B657,1,0)+IF(B658<D658,1,0)","v":3},{"$f":"IF(B655=\"\",0,IF(B655=D655,1,0))+IF(B657=\"\",0,IF(B657=D657,1,0))+IF(B658=\"\",0,IF(B658=D658,1,0))","v":0},{"$f":"IF(D655=\"\",0,+D655)+IF(D657=\"\",0,+D657)+IF(B658=\"\",0,+B658)","v":0},{"$f":"IF(B655=\"\",0,+B655)+IF(B657=\"\",0,+B657)+IF(D658=\"\",0,+D658)","v":10},{"$f":"L658-M658","v":-10},{"$f":"I658*3+K658","v":0},null,"Aurélien Feye (BEL)",3,0,3,0,0,10,-10,0]
[{"$f":"$C80","v":"Kristian Silagiev (ESP)"},{"$f":"IF('Séries individuels'!D467=\"\",\"\",'Séries individuels'!D467)","v":1},"-",{"$f":"IF('Séries individuels'!F467=\"\",\"\",'Séries individuels'!F467)","v":2},{"$f":"$D80","v":"Cristian Fricano  (ITA)"},null,null,null,{"$f":"SUM(I655:I658)","v":6},{"$f":"SUM(J655:J658)","v":6},{"$f":"SUM(K655:K658)","v":0},{"$f":"SUM(L655:L658)","v":21},{"$f":"SUM(M655:M658)","v":21},{"$f":"SUM(N655:N658)","v":0}]

{"sheet":"Séries individuels","index":1,"n_rows":653,"n_cols":16,"rows_kept":653,"cut":false,"hidden":false,"merged":[]}
["Série 1 - 9h00"]
[]
["Tables"]
[null,null,null,null,null,null,null,null,null,null,"Referees","Referees"]
[]
[1,{"$f":"'Individual Groups'!B3","v":"Juan Manuel Noguera (ESP)"},{"$f":"'Individual Groups'!C3","v":"Daniel Cranston (USA)"},6,"-",2,null,null,null,null,"Raffaele Lombardi (AUS)"]
[2,{"$f":"'Individual Groups'!D3","v":"Andrew Abela (MLT)"},{"$f":"'Individual Groups'!E3","v":"Rémi Soret (FRA)"},0,"-",5,null,null,null,null,"Heinz Eder (AUT)"]
[3,{"$f":"'Individual Groups'!B4","v":"Saverio Bari (ITA)"},{"$f":"'Individual Groups'!C4","v":"Jean-Guillaume Einsle (FRA)"},3,"-",3,null,null,null,null,"Julio Candélas (ESP)"]
[4,{"$f":"'Individual Groups'!D4","v":"Janus Gersie (GER)"},{"$f":"'Individual Groups'!E4","v":"Brett Price (ENG)"},5,"-",2,null,null,null,null,"Velissarios Fragakis (GRE)"]
[5,{"$f":"'Individual Groups'!B5","v":"Luca Colangelo (ITA)"},{"$f":"'Individual Groups'!C5","v":"Francis Avellano (GIB)"},7,"-",1,null,null,null,null,"Justin Leroy (BEL)"]
[6,{"$f":"'Individual Groups'!D5","v":"Terry Arnold (ENG)"},{"$f":"'Individual Groups'!E5","v":"Malcolm Lees (SCO)"},2,"-",11,null,null,null,null,"Juan Carlos Pinto (ESP)"]
[7,{"$f":"'Individual Groups'!B6","v":"Daniele Bertelli (ITA)"},{"$f":"'Individual Groups'!C6","v":"José David Somoza (ESP)"},7,"-",0,null,null,null,null,"Marcus Tilgner (GER)"]
[8,{"$f":"'Individual Groups'!D6","v":"Lazaros Papakonstantinou (GRE)"},{"$f":"'Individual Groups'!E6","v":"Patrick Sheridan (USA)"},3,"-",1,null,null,null,null,"Massimo Bolognino (ITA)"]
[9,{"$f":"'Individual Groups'!B7","v":"Massimiliano Nastasi (ITA)"},{"$f":"'Individual Groups'!C7","v":"Marcel Kwiatkowski (GER)"},7,"-",2,null,null,null,null,"Christophe Dheur (BEL)"]
[10,{"$f":"'Individual Groups'!D7","v":"Wolfgang Leitner (AUT)"},{"$f":"'Individual Groups'!E7","v":"Giorgos Koutis (GRE)"},1,"-",0,null,null,null,null,"Jonathan Dotto (GIB)"]
[11,{"$f":"'Individual Groups'!B8","v":"Christian Haas (AUT)"},{"$f":"'Individual Groups'!C8","v":"Luca Zambello (ITA)"},2,"-",3,null,null,null,null,"Kostas Stamokostas (GRE)"]
[12,{"$f":"'Individual Groups'!D8","v":"Sami Targui (BEL)"},{"$f":"'Individual Groups'!E8","v":"Jean-Marie Amberny (FRA)"},1,"-",1,null,null,null,null,"Lawrence Alvarez (GIB)"]
[13,{"$f":"'Individual Groups'!B9","v":"Spyros Hatzaras (GRE)"},{"$f":"'Individual Groups'!C9","v":"Alexander Ruf (GER)"},3,"-",2,null,null,null,null,"Sébastien Scheen (BEL)"]
[14,{"$f":"'Individual Groups'!D9","v":"Fayçal Rouis (FRA)"},{"$f":"'Individual Groups'!E9","v":"Thomas Wittmann (AUT)"},2,"-",0,null,null,null,null,"Angelo Borg (MLT)"]
[15,{"$f":"'Individual Groups'!B10","v":"Alexander Haas (AUT)"},{"$f":"'Individual Groups'!C10","v":"Valéry Dejardin (BEL)"},3,"-",1,null,null,null,null,"Sérgio Ramos (POR)"]
[16,{"$f":"'Individual Groups'!D10","v":"Frank Hagenkötter (GER)"},{"$f":"'Individual Groups'!E10","v":"Romain Lafontaine (FRA)"},2,"-",4,null,null,null,null,"Bessim Golger (BEL)"]
[17,{"$f":"'Individual Groups'!B22","v":"Antonio Montaño (ESP)"},{"$f":"'Individual Groups'!C22","v":"Patrick Dean (GIB)"},0,"-",1,null,null,null,null,"Rémy Huynh (BEL)"]
[18,{"$f":"'Individual Groups'!D22","v":"Dario Passadore (USA)"},{"$f":"'Individual Groups'!E22","v":"Francesco Mattiangeli (ITA)"},1,"-",6,null,null,null,null,"Suguru Fujino (JPN)"]
[19,{"$f":"'Individual Groups'!B23","v":"Pascal Scheen (BEL)"},{"$f":"'Individual Groups'!C23","v":"Mat Atkin (ENG)"},7,"-",0,null,null,null,null,"Mike Tillman (USA)"]
[20,{"$f":"'Individual Groups'!D23","v":"Panagiotis Haratsis (GRE)"},{"$f":"'Individual Groups'!E23","v":"Andreas Jung (GER)"},5,"-",0,null,null,null,null,"Christian Filippella (USA)"]
[21,{"$f":"'Individual Groups'!B24","v":"Vicenç Prats Salat (ESP)"},{"$f":"'Individual Groups'!C24","v":"Frank Stiller (GER)"},2,"-",2,null,null,null,null,"John Field (GIB)"]
[22,{"$f":"'Individual Groups'!D24","v":"Henk Landzaat (NED)"},{"$f":"'Individual Groups'!E24","v":"Paul Eyes (USA)"},1,"-",1,null,null,null,null,"Giorgos Drazinakis (GRE)"]
[23,{"$f":"'Individual Groups'!B25","v":"Daniel Scheen (BEL)"},{"$f":"'Individual Groups'!C25","v":"Karl-Heinz Haider (AUT)"},5,"-",2,null,null,null,null,"Patrick de Jong (NED)"]
[24,{"$f":"'Individual Groups'!D25","v":"Richard Berllaque (GIB)"},{"$f":"'Individual Groups'!E25","v":"Jeremy Bradley (ENG)"},0,"-",3,null,null,null,null,"Massimiliano Croatti (ITA)"]
[25,{"$f":"'Individual Groups'!B26","v":"Günther Bamberzky (AUT)"},{"$f":"'Individual Groups'!C26","v":"Xavier Dubois (FRA)"},2,"-",0,null,null,null,null,"Jason Pisani (MLT)"]
[26,{"$f":"'Individual Groups'!D26","v":"Paul O’Donovan Rossa (USA)"},{"$f":"'Individual Groups'!E26","v":"Phil Redman (ENG)"},0,"-",2,null,null,null,null,"Dimitris Stamatopoulos (GRE)"]
[27,{"$f":"'Individual Groups'!B27","v":"Gianfranco Calonico (ITA)"},{"$f":"'Individual Groups'!C27","v":"Arturo Martínez (ESP)"},2,"-",1,null,null,null,null,"Stéphane Pommier (FRA)"]
[28,{"$f":"'Individual Groups'!D27","v":"Axel Modeste (FRA)"},{"$f":"'Individual Groups'!E27","v":"Andrey K. Nicolaevich (RUS)"},15,"-",0,null,null,null,null,"Marco Zucchi (CZE)"]
[29,{"$f":"'Individual Groups'!B28","v":"Erich Hinkelmann (AUT)"},{"$f":"'Individual Groups'!C28","v":"Davide Lazzari (CZE)"},4,"-",1,null,null,null,null,"Charles Aquilina (MLT)"]
[30,{"$f":"'Individual Groups'!D28","v":"Benoît Massart (BEL)"},{"$f":"'Individual Groups'!E28","v":"Luis Domingo L. Gutiérrez (ESP)"},0,"-",0,null,null,null,null,"Andy Beskaby (SCO)"]
[31,{"$f":"'Individual Groups'!B29","v":"Chris Aggelinas (GRE)"},{"$f":"'Individual Groups'!C29","v":"Éric Naszalyi (FRA)"},1,"-",1,null,null,null,null,"Brian Daley (ENG)"]
[32,{"$f":"'Individual Groups'!D29","v":"Hideaki Wada (JPN)"},{"$f":"'Individual Groups'!E29","v":"Rob Conway (SCO)"},0,"-",6,null,null,null,null,"Rainer Vogt (GER)"]
[33,{"$f":"'Individual Groups'!B41","v":"Paola Forlani (ITA)"},{"$f":"'Individual Groups'!C41","v":"Maike Krause (GER)"},4,"-",0,null,null,null,null,"Eric Threis (BEL)"]
[34,{"$f":"'Individual Groups'!D41","v":"Lydie Pinchart (BEL)"},{"$f":"'Individual Groups'!E41","v":"Elodie Bertholet (BEL)"},0,"-",0,null,null,null,null,"Tom Horn (GER)"]
[35,{"$f":"'Individual Groups'!B42","v":"Emilie Despretz (BEL)"},{"$f":"'Individual Groups'!C42","v":"Arielle Briant (FRA)"},5,"-",0,null,null,null,null,"Antonio Casin (ESP)"]
[36,{"$f":"'Individual Groups'!D42","v":"Paula Maireles  (ESP)"},{"$f":"'Individual Groups'!E42","v":"Eleonora Buttitta (ITA)"},0,"-",5,null,null,null,null,"Quentin Van Glabeke (BEL)"]
[37,{"$f":"'Individual Groups'!B43","v":"Audrey Herbaut (FRA)"},{"$f":"'Individual Groups'!C43","v":"Alyssa Guyaux (BEL)"},2,"-",0,null,null,null,null,"Ricardo Jose (POR)"]
[38,{"$f":"'Individual Groups'!D43","v":"Julia Eglicerio (ESP)"},{"$f":"'Individual Groups'!E43","v":"Conny Vulpes (GER)"},0,"-",0,null,null,null,null,"Théo Modeste (FRA)"]
[39,{"$f":"'Individual Groups'!B44","v":"Victoria Büsing (GER)"},{"$f":"'Individual Groups'!C44","v":"Carolina Villarigues (POR)"},2,"-",0,null,null,null,null,"Corentin Wauthy (BEL)"]
[40,{"$f":"'Individual Groups'!D44","v":"Manon Willem (BEL)"},{"$f":"'Individual Groups'!E44","v":"Kimberley Devreese (BEL)"},1,"-",0,null,null,null,null,"Raphaël Pommier (FRA)"]
[41,{"$f":"'Individual Groups'!B52","v":"Florian Giaux (BEL)"},{"$f":"'Individual Groups'!C52","v":"Jody Henrioul (BEL)"},5,"-",0,null,null,null,null,"Giorgos Aggelinas (GRE)"]
[42,{"$f":"'Individual Groups'!D52","v":"Connor Bowden (ENG)"},{"$f":"'Individual Groups'!E52","v":"Nikos Haratsis (GRE)"},0,"-",5,null,null,null,null,"Alain Jadot (BEL)"]
[43,{"$f":"'Individual Groups'!B53","v":"David González (ESP)"},{"$f":"'Individual Groups'!C53","v":"Nathan Dizier (BEL)"},3,"-",1,null,null,null,null,"John Zammit (MLT)"]
[44,{"$f":"'Individual Groups'!D53","v":"Koshiro Shibata (JPN)"},{"$f":"'Individual Groups'!E53","v":"Marco Di Vito (ITA)"},0,"-",5,null,null,null,null,"Ferrán Coll (ESP)"]
[45,{"$f":"'Individual Groups'!B54","v":"Nicola Borgo (ITA)"},{"$f":"'Individual Groups'!C54","v":"Christopher Bowen (ENG)"},5,"-",0,null,null,null,null,"Robert Green (AUS)"]
[46,{"$f":"'Individual Groups'!D54","v":"Jesús Moreno (ESP)"},{"$f":"'Individual Groups'!E54","v":"Martin Antoine (BEL)"},0,"-",3,null,null,null,null,null,"Jose Luis Bonavia (GIB)"]
[47,{"$f":"'Individual Groups'!B55","v":"Steffen Despretz (BEL)"},{"$f":"'Individual Groups'!C55","v":"Andrea Ciccarelli (ITA)"},2,"-",5,null,null,null,null,"Manfred Pawlica (AUT)"]
[48,{"$f":"'Individual Groups'!D55","v":"Nealmark Bonnici (MLT)"},{"$f":"'Individual Groups'!E55","v":"Fabio Bianco (GER)"},0,"-",5,null,null,null,null,"Stefano De Francesco (ITA)"]
[49,{"$f":"'Individual Groups'!B63","v":"Maxime Rairoux (BEL)"},{"$f":"'Individual Groups'!C63","v":"Florentine Ausset (FRA)"},5,"-",0,null,null,null,null,"Paolo Zambello (ITA)"]
[50,{"$f":"'Individual Groups'!D63","v":"Riccardo Lazzari (ITA)"},{"$f":"'Individual Groups'!E63","v":"Adam Kraus (AUT)"},0,"-",0,null,null,null,null,"Afonso Pereira (POR)"]
[51,{"$f":"'Individual Groups'!B64","v":"Marios Strommer (AUT)"},{"$f":"'Individual Groups'!C64","v":"Andrea Bolognino (ITA)"},4,"-",5,null,null,null,null,"Elliott Bellefontaine (ENG)"]
[52,{"$f":"'Individual Groups'!D64","v":"Vasco Henriques (POR)"},{"$f":"'Individual Groups'!E64","v":"Manuel Politz (GER)"},4,"-",0,null,null,null,null,"William Van den Houte (BEL)"]
[53,{"$f":"'Individual Groups'!B65","v":"Corentin Bouchez (BEL)"},{"$f":"'Individual Groups'!C65","v":"Gonzalo García-Guereta (ESP)"},5,"-",0,null,null,null,null,"Claudio Panebianco (ITA)"]
[54,{"$f":"'Individual Groups'!D65","v":"Daniel Vranovitz (AUT)"},{"$f":"'Individual Groups'!E65","v":"Claudio La Torre (ITA)"},0,"-",5,null,null,null,null,"Arnaud Le Téno (FRA)"]
[55,{"$f":"'Individual Groups'!B66","v":"Jurgen Balzan (MLT)"},{"$f":"'Individual Groups'!C66","v":"Yannick Matusch (GER)"},5,"-",0,null,null,null,null,"Delphine Dieudonne (BEL)"]
[56,{"$f":"'Individual Groups'!D66","v":"Louison Giaux (BEL)"},{"$f":"'Individual Groups'!E66","v":"Jorge Pinero (ESP)"},1,"-",1,null,null,null,null,"Françoise Guyot (FRA)"]
[57,{"$f":"'Individual Groups'!B74","v":"Matteo Cammarata (ITA)"},{"$f":"'Individual Groups'!C74","v":"Victor Dubuc (FRA)"},5,"-",0,null,null,null,null,"Mirjam de Jong (NED)"]
[58,{"$f":"'Individual Groups'!D74","v":"Jérôme Cyganek (BEL)"},{"$f":"'Individual Groups'!E74","v":"Charlotte Bouchez (BEL)"},3,"-",1,null,null,null,null,"Helène Boniface (ITA)"]
[59,{"$f":"'Individual Groups'!B75","v":"Lucas Pere (BEL)"},{"$f":"'Individual Groups'!C75","v":"Lucie Baudour (BEL)"},5,"-",0,null,null,null,null,"Giulia Brillantino (ITA)"]
[60,{"$f":"'Individual Groups'!D75","v":"Louis Fouetillou (FRA)"},{"$f":"'Individual Groups'!E75","v":"Mattia Ferrante (ITA)"},0,"-",2,null,null,null,null,"Mélanie Falcone (BEL)"]
[]
[]
["Série 2 - 9h55"]
[]
["Tables"]
[null,null,null,null,null,null,null,null,null,null,"Referees","Referees"]
[]
[1,{"$f":"'Individual Groups'!B11","v":"Sébastien Scheen (BEL)"},{"$f":"'Individual Groups'!C11","v":"Heinz Eder (AUT)"},5,"-",4,null,null,null,null,"Juan Manuel Noguera (ESP)"]
[2,{"$f":"'Individual Groups'!D11","v":"Julio Candélas (ESP)"},{"$f":"'Individual Groups'!E11","v":"Velissarios Fragakis (GRE)"},0,"-",5,null,null,null,null,"Daniel Cranston (USA)"]
[3,{"$f":"'Individual Groups'!B12","v":"Justin Leroy (BEL)"},{"$f":"'Individual Groups'!C12","v":"Marcus Tilgner (GER)"},8,"-",1,null,null,null,null,"Andrew Abela (MLT)"]
[4,{"$f":"'Individual Groups'!D12","v":"Juan Carlos Pinto (ESP)"},{"$f":"'Individual Groups'!E12","v":"Massimo Bolognino (ITA)"},0,"-",6,null,null,null,null,"Rémi Soret (FRA)"]
[5,{"$f":"'Individual Groups'!B13","v":"Christophe Dheur (BEL)"},{"$f":"'Individual Groups'!C13","v":"Jonathan Dotto (GIB)"},8,"-",0,null,null,null,null,"Saverio Bari (ITA)"]
[6,{"$f":"'Individual Groups'!D13","v":"Kostas Stamokostas (GRE)"},{"$f":"'Individual Groups'!E13","v":"Raffaele Lombardi (AUS)"},4,"-",0,null,null,null,null,"Jean-Guillaume Einsle (FRA)"]
[7,{"$f":"'Individual Groups'!B14","v":"Angelo Borg (MLT)"},{"$f":"'Individual Groups'!C14","v":"Suguru Fujino (JPN)"},9,"-",0,null,null,null,null,"Janus Gersie (GER)"]
[8,{"$f":"'Individual Groups'!D14","v":"Bessim Golger (BEL)"},{"$f":"'Individual Groups'!E14","v":"Mike Tillman (USA)"},5,"-",0,null,null,null,null,"Brett Price (ENG)"]
[9,{"$f":"'Individual Groups'!B15","v":"Sérgio Ramos (POR)"},{"$f":"'Individual Groups'!C15","v":"Lawrence Alvarez (GIB)"},7,"-",0,null,null,null,null,"Luca Colangelo (ITA)"]
[10,{"$f":"'Individual Groups'!D15","v":"Rémy Huynh (BEL)"},{"$f":"'Individual Groups'!E15","v":"Christian Filippella (USA)"},2,"-",1,null,null,null,null,"Terry Arnold (ENG)"]
[11,{"$f":"'Individual Groups'!B16","v":"Kostas Seses (GRE)"},{"$f":"'Individual Groups'!C16","v":"Axel Donval (FRA)"},2,"-",3,null,null,null,null,"Francis Avellano (GIB)"]
[12,{"$f":"'Individual Groups'!D16","v":"Nuno Henriques (POR)"},{"$f":"'Individual Groups'!E16","v":"Luca Martinelli (ENG)"},0,"-",0,null,null,null,null,"Malcolm Lees (SCO)"]
[13,{"$f":"'Individual Groups'!B17","v":"Derek Conti (MLT)"},{"$f":"'Individual Groups'!C17","v":"Anton V. Aleksadrovich (RUS)"},3,"-",0,null,null,null,null,"Daniele Bertelli (ITA)"]
[14,{"$f":"'Individual Groups'!D17","v":"Gareth Christie (SCO)"},{"$f":"'Individual Groups'!E17","v":"Spyros Patrinos (GRE)"},0,"-",0,null,null,null,null,"José David Somoza (ESP)"]
[15,{"$f":"'Individual Groups'!B18","v":"Wolfgang Haas (AUT)"},{"$f":"'Individual Groups'!C18","v":"Dmitry L. Valeriavitch (RUS)"},8,"-",0,null,null,null,null,"Lazaros Papakonstantinou (GRE)"]
[16,{"$f":"'Individual Groups'!D18","v":"Luis Abreu (POR)"},{"$f":"'Individual Groups'!E18","v":"Maikel de Haas (NED)"},2,"-",5,null,null,null,null,"Pascal Scheen (BEL)"]
[17,{"$f":"'Individual Groups'!B30","v":"John Field (GIB)"},{"$f":"'Individual Groups'!C30","v":"Giorgos Drazinakis (GRE)"},1,"-",1,null,null,null,null,"Patrick Sheridan (USA)"]
[18,{"$f":"'Individual Groups'!D30","v":"Patrick de Jong (NED)"},{"$f":"'Individual Groups'!E30","v":"Massimiliano Croatti (ITA)"},2,"-",1,null,null,null,null,"Wolfgang Leitner (AUT)"]
[19,{"$f":"'Individual Groups'!B31","v":"Jason Pisani (MLT)"},{"$f":"'Individual Groups'!C31","v":"Dimitris Stamatopoulos (GRE)"},2,"-",0,null,null,null,null,"Marcel Kwiatkowski (GER)"]
[20,{"$f":"'Individual Groups'!D31","v":"Stéphane Pommier (FRA)"},{"$f":"'Individual Groups'!E31","v":"Marco Zucchi (CZE)"},1,"-",0,null,null,null,null,"Giorgos Koutis (GRE)"]
[21,{"$f":"'Individual Groups'!B32","v":"Charles Aquilina (MLT)"},{"$f":"'Individual Groups'!C32","v":"Andy Beskaby (SCO)"},3,"-",0,null,null,null,null,"Antonio Montaño (ESP)"]
[22,{"$f":"'Individual Groups'!D32","v":"Brian Daley (ENG)"},{"$f":"'Individual Groups'!E32","v":"Rainer Vogt (GER)"},3,"-",3,null,null,null,null,"Patrick Dean (GIB)"]
[23,{"$f":"'Individual Groups'!B33","v":"Eric Threis (BEL)"},{"$f":"'Individual Groups'!C33","v":"Tom Horn (GER)"},7,"-",1,null,null,null,null,"Dario Passadore (USA)"]
[24,{"$f":"'Individual Groups'!D33","v":"Giorgos Aggelinas (GRE)"},{"$f":"'Individual Groups'!E33","v":"John Zammit (MLT)"},0,"-",0,null,null,null,null,"Francesco Mattiangeli (ITA)"]
[25,{"$f":"'Individual Groups'!B34","v":"Alain Jadot (BEL)"},{"$f":"'Individual Groups'!C34","v":"Ferrán Coll (ESP)"},2,"-",0,null,null,null,null,"Massimiliano Nastasi (ITA)"]
[26,{"$f":"'Individual Groups'!D34","v":"Robert Green (AUS)"},{"$f":"'Individual Groups'!E34","v":"Jose Luis Bonavia (GIB)"},0,"-",1,null,null,null,null,"Mat Atkin (ENG)"]
[27,{"$f":"'Individual Groups'!B35","v":"Manfred Pawlica (AUT)"},{"$f":"'Individual Groups'!C35","v":"Stefano De Francesco (ITA)"},0,"-",1,null,null,null,null,"Panagiotis Haratsis (GRE)"]
[28,{"$f":"'Individual Groups'!D35","v":"Thierry Vivron (FRA)"},{"$f":"'Individual Groups'!E35","v":"Arnold Mair (GER)"},0,"-",7,null,null,null,null,"Vicenç Prats Salat (ESP)"]
[29,{"$f":"'Individual Groups'!B36","v":"Patrizio Lazzaretti (ITA)"},{"$f":"'Individual Groups'!C36","v":"Gregg Deinhart (USA)"},4,"-",0,null,null,null,null,"Andreas Jung (GER)"]
[30,{"$f":"'Individual Groups'!D36","v":"Justin Finch (ENG)"},{"$f":"'Individual Groups'!E36","v":"Guy Palmer (GIB)"},0,"-",2,null,null,null,null,"Frank Stiller (GER)"]
[31,{"$f":"'Individual Groups'!B37","v":"David Busch (AUT)"},{"$f":"'Individual Groups'!C37","v":"Massimo Cremona (MLT)"},0,"-",2,null,null,null,null,"Henk Landzaat (NED)"]
[32,{"$f":"'Individual Groups'!D37","v":"Juan Carlos Granados (ESP)"},{"$f":"'Individual Groups'!E37","v":"Vito Di Ruggiero (BEL)"},4,"-",2,null,null,null,null,"Paul Eyes (USA)"]
[33,{"$f":"'Individual Groups'!B45","v":"Delphine Dieudonne (BEL)"},{"$f":"'Individual Groups'!C45","v":"Mélanie Falcone (BEL)"},3,"-",1,null,null,null,null,"Karl-Heinz Haider (AUT)"]
[34,{"$f":"'Individual Groups'!D45","v":"Mirjam de Jong (NED)"},{"$f":"'Individual Groups'!E45","v":"Helène Boniface (ITA)"},0,"-",3,null,null,null,null,"Daniel Scheen (BEL)"]
[35,{"$f":"'Individual Groups'!B46","v":"Giulia Brillantino (ITA)"},{"$f":"'Individual Groups'!C46","v":"Françoise Guyot (FRA)"},1,"-",1,null,null,null,null,"Connor Bowden (ENG)"]
[36,{"$f":"'Individual Groups'!D46","v":"Daria Prazynski (GER)"},{"$f":"'Individual Groups'!E46","v":"Cynthia Bouchez (BEL)"},0,"-",4,null,null,null,null,"Nikos Haratsis (GRE)"]
[37,{"$f":"'Individual Groups'!B47","v":"Margault Delval (BEL)"},{"$f":"'Individual Groups'!C47","v":"Isabelle Daelman (BEL)"},5,"-",0,null,null,null,null,"David González (ESP)"]
[38,{"$f":"'Individual Groups'!D47","v":"Giuditta Lo Cascio (ITA)"},{"$f":"'Individual Groups'!E47","v":"Sylvie Guyot (FRA)"},3,"-",0,null,null,null,null,"Florian Giaux (BEL)"]
[39,{"$f":"'Individual Groups'!B56","v":"Antonio Casin (ESP)"},{"$f":"'Individual Groups'!C56","v":"Quentin Van Glabeke (BEL)"},5,"-",0,null,null,null,null,"Richard Berllaque (GIB)"]
[40,{"$f":"'Individual Groups'!D56","v":"Théo Modeste (FRA)"},{"$f":"'Individual Groups'!E56","v":"Ricardo Jose (POR)"},2,"-",1,null,null,null,null,"Jody Henrioul (BEL)"]
[41,{"$f":"'Individual Groups'!B57","v":"Raphaël Pommier (FRA)"},{"$f":"'Individual Groups'!C57","v":"Corentin Wauthy (BEL)"},3,"-",1,null,null,null,null,"Jeremy Bradley (ENG)"]
[42,{"$f":"'Individual Groups'!D57","v":"Afonso Pereira (POR)"},{"$f":"'Individual Groups'!E57","v":"Paolo Zambello (ITA)"},2,"-",2,null,null,null,null,"Nathan Dizier (BEL)"]
[43,{"$f":"'Individual Groups'!B58","v":"Elliott Bellefontaine (ENG)"},{"$f":"'Individual Groups'!C58","v":"William Van den Houte (BEL)"},1,"-",3,null,null,null,null,"Xavier Dubois (FRA)"]
[44,{"$f":"'Individual Groups'!D58","v":"Claudio Panebianco (ITA)"},{"$f":"'Individual Groups'!E58","v":"Arnaud Le Téno (FRA)"},4,"-",2,null,null,null,null,"Günther Bamberzky (AUT)"]
[45,{"$f":"'Individual Groups'!B59","v":"Matteo Ciccarelli (ITA)"},{"$f":"'Individual Groups'!C59","v":"Kai Hagenkötter (GER)"},2,"-",1,null,null,null,null,"Paul O’Donovan Rossa (USA)"]
[46,{"$f":"'Individual Groups'!D59","v":"Maxime Muraille (BEL)"},{"$f":"'Individual Groups'!E59","v":"Paul Naszalyi (FRA)"},2,"-",1,null,null,null,null,"Phil Redman (ENG)"]
[47,{"$f":"'Individual Groups'!B67","v":"Leonardo Giudice (ITA)"},{"$f":"'Individual Groups'!C67","v":"Niall Dean (GIB)"},5,"-",0,null,null,null,null,"Arturo Martínez (ESP)"]
[48,{"$f":"'Individual Groups'!D67","v":"Thomas Price (ENG)"},{"$f":"'Individual Groups'!E67","v":"Corentin Boltz (BEL)"},2,"-",3,null,null,null,null,"Gianfranco Calonico (ITA)"]
[49,{"$f":"'Individual Groups'!B68","v":"Alwin Krause (GER)"},{"$f":"'Individual Groups'!C68","v":"Antonio García Fernández (ESP)"},1,"-",0,null,null,null,null,"Koshiro Shibata (JPN)"]
[50,{"$f":"'Individual Groups'!D68","v":"Eliott Legall (FRA)"},{"$f":"'Individual Groups'!E68","v":"Jonathan Nichtenberger (AUT)"},1,"-",0,null,null,null,null,"Marco Di Vito (ITA)"]
[51,{"$f":"'Individual Groups'!B76","v":"Basile Magermans (BEL)"},{"$f":"'Individual Groups'!C76","v":"Léa Despretz (BEL)"},5,"-",0,null,null,null,null,"Nicola Borgo (ITA)"]
[52,{"$f":"'Individual Groups'!D76","v":"Diogo Pereira (POR)"},{"$f":"'Individual Groups'!E76","v":"Carlos Pinto (ESP)"},2,"-",0,null,null,null,null,"Martin Antoine (BEL)"]
[53,{"$f":"'Individual Groups'!B77","v":"Riccardo Natoli (ITA)"},{"$f":"'Individual Groups'!C77","v":"Jann Segers (BEL)"},3,"-",0,null,null,null,null,"Christopher Bowen (ENG)","Jesús Moreno (ESP)"]
[54,{"$f":"'Individual Groups'!D77","v":"Conor Atkin (ENG)"},{"$f":"'Individual Groups'!E77","v":"Quentin Ausset (FRA)"},0,"-",1,null,null,null,null,"Paola Forlani (ITA)"]
[55,{"$f":"'Individual Groups'!B78","v":"Francesco Tozzi (ITA)"},{"$f":"'Individual Groups'!C78","v":"Gabriel Lombardi (AUS)"},3,"-",0,"ff"]
[56,{"$f":"'Individual Groups'!D78","v":"Noah Denne (BEL)"},{"$f":"'Individual Groups'!E78","v":"Jesús Maireles (ESP)"},0,"-",1,null,null,null,null,"Arielle Briant (FRA)"]
[57,{"$f":"'Individual Groups'!B79","v":"Giorgio Giudice (ITA)"},{"$f":"'Individual Groups'!C79","v":"Joseph Agius (MLT)"},1,"-",0,null,null,null,null,"Emilie Despretz (BEL)"]
[58,{"$f":"'Individual Groups'!D79","v":"Mark Offmann (FRA)"},{"$f":"'Individual Groups'!E79","v":"Alex Genart (BEL)"},3,"-",2,null,null,null,null,"Maike Krause (GER)"]
[59,"Arbitres",null,null,"-"]
[60,"réservistes",null,null,"-"]
[]
[]
["Série 3 - 10h50"]
[]
["Tables"]
[null,null,null,null,null,null,null,null,null,null,"Referees","Referees"]
[]
[1,{"$f":"'Individual Groups'!B3","v":"Juan Manuel Noguera (ESP)"},{"$f":"'Individual Groups'!D3","v":"Andrew Abela (MLT)"},8,"-",1,null,null,null,null,"Dmitry L. Valeriavitch (RUS)"]
[2,{"$f":"'Individual Groups'!C3","v":"Daniel Cranston (USA)"},{"$f":"'Individual Groups'!E3","v":"Rémi Soret (FRA)"},0,"-",2,null,null,null,null,"Kostas Seses (GRE)"]
[3,{"$f":"'Individual Groups'!B4","v":"Saverio Bari (ITA)"},{"$f":"'Individual Groups'!D4","v":"Janus Gersie (GER)"},7,"-",1,null,null,null,null,"Luca Martinelli (ENG)"]
[4,{"$f":"'Individual Groups'!C4","v":"Jean-Guillaume Einsle (FRA)"},{"$f":"'Individual Groups'!E4","v":"Brett Price (ENG)"},10,"-",0,null,null,null,null,"Nuno Henriques (POR)"]
[5,{"$f":"'Individual Groups'!B5","v":"Luca Colangelo (ITA)"},{"$f":"'Individual Groups'!D5","v":"Terry Arnold (ENG)"},13,"-",1,null,null,null,null,"Derek Conti (MLT)"]
[6,{"$f":"'Individual Groups'!C5","v":"Francis Avellano (GIB)"},{"$f":"'Individual Groups'!E5","v":"Malcolm Lees (SCO)"},1,"-",3,null,null,null,null,"Anton V. Aleksadrovich (RUS)"]
[7,{"$f":"'Individual Groups'!B6","v":"Daniele Bertelli (ITA)"},{"$f":"'Individual Groups'!D6","v":"Lazaros Papakonstantinou (GRE)"},8,"-",2,null,null,null,null,"Gareth Christie (SCO)"]
[8,{"$f":"'Individual Groups'!C6","v":"José David Somoza (ESP)"},{"$f":"'Individual Groups'!E6","v":"Patrick Sheridan (USA)"},0,"-",3,null,null,null,null,"Spyros Patrinos (GRE)"]
[9,{"$f":"'Individual Groups'!B7","v":"Massimiliano Nastasi (ITA)"},{"$f":"'Individual Groups'!D7","v":"Wolfgang Leitner (AUT)"},1,"-",3,null,null,null,null,"Luis Abreu (POR)"]
[10,{"$f":"'Individual Groups'!C7","v":"Marcel Kwiatkowski (GER)"},{"$f":"'Individual Groups'!E7","v":"Giorgos Koutis (GRE)"},2,"-",4,null,null,null,null,"Wolfgang Haas (AUT)"]
[11,{"$f":"'Individual Groups'!B8","v":"Christian Haas (AUT)"},{"$f":"'Individual Groups'!D8","v":"Sami Targui (BEL)"},1,"-",2,null,null,null,null,"Axel Donval (FRA)"]
[12,{"$f":"'Individual Groups'!C8","v":"Luca Zambello (ITA)"},{"$f":"'Individual Groups'!E8","v":"Jean-Marie Amberny (FRA)"},3,"-",2,null,null,null,null,"Maikel de Haas (NED)"]
[13,{"$f":"'Individual Groups'!B9","v":"Spyros Hatzaras (GRE)"},{"$f":"'Individual Groups'!D9","v":"Fayçal Rouis (FRA)"},3,"-",1,null,null,null,null,"Heinz Eder (AUT)"]
[14,{"$f":"'Individual Groups'!C9","v":"Alexander Ruf (GER)"},{"$f":"'Individual Groups'!E9","v":"Thomas Wittmann (AUT)"},3,"-",0,null,null,null,null,"Sébastien Scheen (BEL)"]
[15,{"$f":"'Individual Groups'!B10","v":"Alexander Haas (AUT)"},{"$f":"'Individual Groups'!D10","v":"Frank Hagenkötter (GER)"},5,"-",3,null,null,null,null,"Julio Candélas (ESP)"]
[16,{"$f":"'Individual Groups'!C10","v":"Valéry Dejardin (BEL)"},{"$f":"'Individual Groups'!E10","v":"Romain Lafontaine (FRA)"},2,"-",1,null,null,null,null,"Velissarios Fragakis (GRE)"]
[17,{"$f":"'Individual Groups'!B22","v":"Antonio Montaño (ESP)"},{"$f":"'Individual Groups'!D22","v":"Dario Passadore (USA)"},6,"-",1,null,null,null,null,"Justin Leroy (BEL)"]
[18,{"$f":"'Individual Groups'!C22","v":"Patrick Dean (GIB)"},{"$f":"'Individual Groups'!E22","v":"Francesco Mattiangeli (ITA)"},0,"-",3,null,null,null,null,"Marcus Tilgner (GER)"]
[19,{"$f":"'Individual Groups'!B23","v":"Pascal Scheen (BEL)"},{"$f":"'Individual Groups'!D23","v":"Panagiotis Haratsis (GRE)"},3,"-",2,null,null,null,null,"Juan Carlos Pinto (ESP)"]
[20,{"$f":"'Individual Groups'!C23","v":"Mat Atkin (ENG)"},{"$f":"'Individual Groups'!E23","v":"Andreas Jung (GER)"},1,"-",4,null,null,null,null,"Massimo Bolognino (ITA)"]
[21,{"$f":"'Individual Groups'!B24","v":"Vicenç Prats Salat (ESP)"},{"$f":"'Individual Groups'!D24","v":"Henk Landzaat (NED)"},6,"-",1,null,null,null,null,"Christophe Dheur (BEL)"]
[22,{"$f":"'Individual Groups'!C24","v":"Frank Stiller (GER)"},{"$f":"'Individual Groups'!E24","v":"Paul Eyes (USA)"},2,"-",0,null,null,null,null,"Jonathan Dotto (GIB)"]
[23,{"$f":"'Individual Groups'!B25","v":"Daniel Scheen (BEL)"},{"$f":"'Individual Groups'!D25","v":"Richard Berllaque (GIB)"},9,"-",0,null,null,null,null,"Patrizio Lazzaretti (ITA)"]
[24,{"$f":"'Individual Groups'!C25","v":"Karl-Heinz Haider (AUT)"},{"$f":"'Individual Groups'!E25","v":"Jeremy Bradley (ENG)"},2,"-",2,null,null,null,null,"Gregg Deinhart (USA)"]
[25,{"$f":"'Individual Groups'!B26","v":"Günther Bamberzky (AUT)"},{"$f":"'Individual Groups'!D26","v":"Paul O’Donovan Rossa (USA)"},2,"-",0,null,null,null,null,"Justin Finch (ENG)"]
[26,{"$f":"'Individual Groups'!C26","v":"Xavier Dubois (FRA)"},{"$f":"'Individual Groups'!E26","v":"Phil Redman (ENG)"},1,"-",1,null,null,null,null,"Guy Palmer (GIB)"]
[27,{"$f":"'Individual Groups'!B27","v":"Gianfranco Calonico (ITA)"},{"$f":"'Individual Groups'!D27","v":"Axel Modeste (FRA)"},4,"-",1,null,null,null,null,"David Busch (AUT)"]
[28,{"$f":"'Individual Groups'!C27","v":"Arturo Martínez (ESP)"},{"$f":"'Individual Groups'!E27","v":"Andrey K. Nicolaevich (RUS)"},19,"-",0,null,null,null,null,"Massimo Cremona (MLT)"]
[29,{"$f":"'Individual Groups'!B28","v":"Erich Hinkelmann (AUT)"},{"$f":"'Individual Groups'!D28","v":"Benoît Massart (BEL)"},2,"-",1,null,null,null,null,"Juan Carlos Granados (ESP)"]
[30,{"$f":"'Individual Groups'!C28","v":"Davide Lazzari (CZE)"},{"$f":"'Individual Groups'!E28","v":"Luis Domingo L. Gutiérrez (ESP)"},2,"-",2,null,null,null,null,"Vito Di Ruggiero (BEL)"]
[31,{"$f":"'Individual Groups'!B29","v":"Chris Aggelinas (GRE)"},{"$f":"'Individual Groups'!D29","v":"Hideaki Wada (JPN)"},11,"-",0,null,null,null,null,"John Field (GIB)"]
[32,{"$f":"'Individual Groups'!C29","v":"Éric Naszalyi (FRA)"},{"$f":"'Individual Groups'!E29","v":"Rob Conway (SCO)"},4,"-",1,null,null,null,null,"Giorgos Drazinakis (GRE)"]
[33,{"$f":"'Individual Groups'!B41","v":"Paola Forlani (ITA)"},{"$f":"'Individual Groups'!D41","v":"Lydie Pinchart (BEL)"},2,"-",3,null,null,null,null,"Patrick de Jong (NED)"]
[34,{"$f":"'Individual Groups'!C41","v":"Maike Krause (GER)"},{"$f":"'Individual Groups'!E41","v":"Elodie Bertholet (BEL)"},0,"-",2,null,null,null,null,"Massimiliano Croatti (ITA)"]
[35,{"$f":"'Individual Groups'!B42","v":"Emilie Despretz (BEL)"},{"$f":"'Individual Groups'!D42","v":"Paula Maireles  (ESP)"},5,"-",1,null,null,null,null,"Jason Pisani (MLT)"]
[36,{"$f":"'Individual Groups'!C42","v":"Arielle Briant (FRA)"},{"$f":"'Individual Groups'!E42","v":"Eleonora Buttitta (ITA)"},1,"-",3,null,null,null,null,"Dimitris Stamatopoulos (GRE)"]
[37,{"$f":"'Individual Groups'!B43","v":"Audrey Herbaut (FRA)"},{"$f":"'Individual Groups'!D43","v":"Julia Eglicerio (ESP)"},5,"-",0,null,null,null,null,"Steffen Despretz (BEL)"]
[38,{"$f":"'Individual Groups'!C43","v":"Alyssa Guyaux (BEL)"},{"$f":"'Individual Groups'!E43","v":"Conny Vulpes (GER)"},0,"-",0,null,null,null,null,"Andy Beskaby (SCO)"]
[39,{"$f":"'Individual Groups'!B44","v":"Victoria Büsing (GER)"},{"$f":"'Individual Groups'!D44","v":"Manon Willem (BEL)"},2,"-",0,null,null,null,null,"Charles Aquilina (MLT)"]
[40,{"$f":"'Individual Groups'!C44","v":"Carolina Villarigues (POR)"},{"$f":"'Individual Groups'!E44","v":"Kimberley Devreese (BEL)"},5,"-",0,null,null,null,null,"Andrea Ciccarelli (ITA)"]
[41,{"$f":"'Individual Groups'!B52","v":"Florian Giaux (BEL)"},{"$f":"'Individual Groups'!D52","v":"Connor Bowden (ENG)"},2,"-",0,null,null,null,null,"Stéphane Pommier (FRA)"]
[42,{"$f":"'Individual Groups'!C52","v":"Jody Henrioul (BEL)"},{"$f":"'Individual Groups'!E52","v":"Nikos Haratsis (GRE)"},1,"-",11,null,null,null,null,"Marco Zucchi (CZE)"]
[43,{"$f":"'Individual Groups'!B53","v":"David González (ESP)"},{"$f":"'Individual Groups'!D53","v":"Koshiro Shibata (JPN)"},7,"-",0,null,null,null,null,"Thierry Vivron (FRA)"]
[44,{"$f":"'Individual Groups'!C53","v":"Nathan Dizier (BEL)"},{"$f":"'Individual Groups'!E53","v":"Marco Di Vito (ITA)"},0,"-",4,null,null,null,null,"Arnold Mair (GER)"]
[45,{"$f":"'Individual Groups'!B69","v":"Kye Arnold (ENG)"},{"$f":"'Individual Groups'!C69","v":"Moritz Jung (GER)"},0,"-",5,null,null,null,null,"Nealmark Bonnici (MLT)"]
[46,{"$f":"'Individual Groups'!D69","v":"Antonio La Torre (ITA)"},{"$f":"'Individual Groups'!E69","v":"Paul Offmann (FRA)"},4,"-",1,null,null,null,null,"Fabio Bianco (GER)"]
[47,{"$f":"'Individual Groups'!B70","v":"Lukas Eppensteiner (AUT)"},{"$f":"'Individual Groups'!C70","v":"Matteo Brillantino (ITA)"},1,"-",1,null,null,null,null,"Kai Hagenkötter (GER)"]
[48,{"$f":"'Individual Groups'!D70","v":"Rhys Williams (ENG)"},{"$f":"'Individual Groups'!E70","v":"Mathéo Grégoire (BEL)"},1,"-",2,null,null,null,null,"Matteo Ciccarelli (ITA)"]
[49,{"$f":"'Individual Groups'!B63","v":"Maxime Rairoux (BEL)"},{"$f":"'Individual Groups'!D63","v":"Riccardo Lazzari (ITA)"},2,"-",0,null,null,null,null,"Christopher Bowen (ENG)"]
[50,{"$f":"'Individual Groups'!C63","v":"Florentine Ausset (FRA)"},{"$f":"'Individual Groups'!E63","v":"Adam Kraus (AUT)"},1,"-",0,null,null,null,null,"Maxime Muraille (BEL)"]
[51,{"$f":"'Individual Groups'!B64","v":"Marios Strommer (AUT)"},{"$f":"'Individual Groups'!D64","v":"Vasco Henriques (POR)"},5,"-",0,null,null,null,null,"Cynthia Bouchez (BEL)"]
[52,{"$f":"'Individual Groups'!C64","v":"Andrea Bolognino (ITA)"},{"$f":"'Individual Groups'!E64","v":"Manuel Politz (GER)"},5,"-",0,null,null,null,null,"Margault Delval (BEL)"]
[53,{"$f":"'Individual Groups'!B80","v":"Joshua Foreman (ENG)"},{"$f":"'Individual Groups'!C80","v":"Kristian Silagiev (ESP)"},0,"-",3,null,null,null,null,"Isabelle Daelman (BEL)"]
[54,{"$f":"'Individual Groups'!D80","v":"Cristian Fricano  (ITA)"},{"$f":"'Individual Groups'!E80","v":"Aurélien Feye (BEL)"},5,"-",0,null,null,null,null,"Daria Prazynski (GER)"]
[55,{"$f":"'Individual Groups'!B74","v":"Matteo Cammarata (ITA)"},{"$f":"'Individual Groups'!D74","v":"Jérôme Cyganek (BEL)"},5,"-",0,null,null,null,null,"Paul Naszalyi (FRA)"]
[56,{"$f":"'Individual Groups'!C74","v":"Victor Dubuc (FRA)"},{"$f":"'Individual Groups'!E74","v":"Charlotte Bouchez (BEL)"},1,"-",1,null,null,null,null,"Giuditta Lo Cascio (ITA)"]
[57,{"$f":"'Individual Groups'!B75","v":"Lucas Pere (BEL)"},{"$f":"'Individual Groups'!D75","v":"Louis Fouetillou (FRA)"},2,"-",0,null,null,null,null,"Nicola Borgo (ITA)"]
[58,{"$f":"'Individual Groups'!C75","v":"Lucie Baudour (BEL)"},{"$f":"'Individual Groups'!E75","v":"Mattia Ferrante (ITA)"},0,"-",4,null,null,null,null,"Sylvie Guyot (FRA)"]
[59,null,null,null,"-"]
[60,null,null,null,"-"]
[]
[]
["Série 4 - 11h45"]
[]
["Tables"]
[null,null,null,null,null,null,null,null,null,null,null,"Referees"]
[]
[1,{"$f":"'Individual Groups'!B11","v":"Sébastien Scheen (BEL)"},{"$f":"'Individual Groups'!D11","v":"Julio Candélas (ESP)"},6,"-",0,null,null,null,null,"Luca Zambello (ITA)"]
[2,{"$f":"'Individual Groups'!C11","v":"Heinz Eder (AUT)"},{"$f":"'Individual Groups'!E11","v":"Velissarios Fragakis (GRE)"},5,"-",1,null,null,null,null,"Sami Targui (BEL)"]
[3,{"$f":"'Individual Groups'!B12","v":"Justin Leroy (BEL)"},{"$f":"'Individual Groups'!D12","v":"Juan Carlos Pinto (ESP)"},6,"-",0,null,null,null,null,"Christian Haas (AUT)"]
[4,{"$f":"'Individual Groups'!C12","v":"Marcus Tilgner (GER)"},{"$f":"'Individual Groups'!E12","v":"Massimo Bolognino (ITA)"},2,"-",6,null,null,null,null,"Spyros Hatzaras (GRE)"]
[5,{"$f":"'Individual Groups'!B13","v":"Christophe Dheur (BEL)"},{"$f":"'Individual Groups'!D13","v":"Kostas Stamokostas (GRE)"},5,"-",1,null,null,null,null,"Jean-Marie Amberny (FRA)"]
[6,{"$f":"'Individual Groups'!C13","v":"Jonathan Dotto (GIB)"},{"$f":"'Individual Groups'!E13","v":"Raffaele Lombardi (AUS)"},0,"-",2,null,null,null,null,"Romain Lafontaine (FRA)"]
[7,{"$f":"'Individual Groups'!B14","v":"Angelo Borg (MLT)"},{"$f":"'Individual Groups'!D14","v":"Bessim Golger (BEL)"},0,"-",1,null,null,null,null,"Alexander Ruf (GER)"]
[8,{"$f":"'Individual Groups'!C14","v":"Suguru Fujino (JPN)"},{"$f":"'Individual Groups'!E14","v":"Mike Tillman (USA)"},0,"-",5,null,null,null,null,"Fayçal Rouis (FRA)"]
[9,{"$f":"'Individual Groups'!B15","v":"Sérgio Ramos (POR)"},{"$f":"'Individual Groups'!D15","v":"Rémy Huynh (BEL)"},1,"-",1,null,null,null,null,"Thomas Wittmann (AUT)"]
[10,{"$f":"'Individual Groups'!C15","v":"Lawrence Alvarez (GIB)"},{"$f":"'Individual Groups'!E15","v":"Christian Filippella (USA)"},1,"-",10,null,null,null,null,"Alexander Haas (AUT)"]
[11,{"$f":"'Individual Groups'!B16","v":"Kostas Seses (GRE)"},{"$f":"'Individual Groups'!D16","v":"Nuno Henriques (POR)"},3,"-",0,null,null,null,null,"Valéry Dejardin (BEL)"]
[12,{"$f":"'Individual Groups'!C16","v":"Axel Donval (FRA)"},{"$f":"'Individual Groups'!E16","v":"Luca Martinelli (ENG)"},0,"-",1,null,null,null,null,"Frank Hagenkötter (GER)"]
[13,{"$f":"'Individual Groups'!B17","v":"Derek Conti (MLT)"},{"$f":"'Individual Groups'!D17","v":"Gareth Christie (SCO)"},2,"-",0,null,null,null,null,"Juan Manuel Noguera (ESP)"]
[14,{"$f":"'Individual Groups'!C17","v":"Anton V. Aleksadrovich (RUS)"},{"$f":"'Individual Groups'!E17","v":"Spyros Patrinos (GRE)"},0,"-",17,null,null,null,null,"Daniel Cranston (USA)"]
[15,{"$f":"'Individual Groups'!B18","v":"Wolfgang Haas (AUT)"},{"$f":"'Individual Groups'!D18","v":"Luis Abreu (POR)"},4,"-",2,null,null,null,null,"Andrew Abela (MLT)"]
[16,{"$f":"'Individual Groups'!C18","v":"Dmitry L. Valeriavitch (RUS)"},{"$f":"'Individual Groups'!E18","v":"Maikel de Haas (NED)"},1,"-",10,null,null,null,null,"Rémi Soret (FRA)"]
[17,{"$f":"'Individual Groups'!B30","v":"John Field (GIB)"},{"$f":"'Individual Groups'!D30","v":"Patrick de Jong (NED)"},5,"-",1,null,null,null,null,"Saverio Bari (ITA)"]
[18,{"$f":"'Individual Groups'!C30","v":"Giorgos Drazinakis (GRE)"},{"$f":"'Individual Groups'!E30","v":"Massimiliano Croatti (ITA)"},1,"-",5,null,null,null,null,"Jean-Guillaume Einsle (FRA)"]
[19,{"$f":"'Individual Groups'!B31","v":"Jason Pisani (MLT)"},{"$f":"'Individual Groups'!D31","v":"Stéphane Pommier (FRA)"},2,"-",1,null,null,null,null,"Janus Gersie (GER)"]
[20,{"$f":"'Individual Groups'!C31","v":"Dimitris Stamatopoulos (GRE)"},{"$f":"'Individual Groups'!E31","v":"Marco Zucchi (CZE)"},3,"-",1,null,null,null,null,"Brett Price (ENG)"]
[21,{"$f":"'Individual Groups'!B32","v":"Charles Aquilina (MLT)"},{"$f":"'Individual Groups'!D32","v":"Brian Daley (ENG)"},5,"-",0,null,null,null,null,"Luca Colangelo (ITA)"]
[22,{"$f":"'Individual Groups'!C32","v":"Andy Beskaby (SCO)"},{"$f":"'Individual Groups'!E32","v":"Rainer Vogt (GER)"},2,"-",5,null,null,null,null,"Francis Avellano (GIB)"]
[23,{"$f":"'Individual Groups'!B33","v":"Eric Threis (BEL)"},{"$f":"'Individual Groups'!D33","v":"Giorgos Aggelinas (GRE)"},6,"-",1,null,null,null,null,"Axel Modeste (FRA)"]
[24,{"$f":"'Individual Groups'!C33","v":"Tom Horn (GER)"},{"$f":"'Individual Groups'!E33","v":"John Zammit (MLT)"},2,"-",5,null,null,null,null,"Andrey K. Nicolaevich (RUS)"]
[25,{"$f":"'Individual Groups'!B34","v":"Alain Jadot (BEL)"},{"$f":"'Individual Groups'!D34","v":"Robert Green (AUS)"},3,"-",1,null,null,null,null,"Erich Hinkelmann (AUT)"]
[26,{"$f":"'Individual Groups'!C34","v":"Ferrán Coll (ESP)"},{"$f":"'Individual Groups'!E34","v":"Jose Luis Bonavia (GIB)"},5,"-",2,null,null,null,null,"Davide Lazzari (CZE)"]
[27,{"$f":"'Individual Groups'!B35","v":"Manfred Pawlica (AUT)"},{"$f":"'Individual Groups'!D35","v":"Thierry Vivron (FRA)"},2,"-",2,null,null,null,null,"Benoît Massart (BEL)"]
[28,{"$f":"'Individual Groups'!C35","v":"Stefano De Francesco (ITA)"},{"$f":"'Individual Groups'!E35","v":"Arnold Mair (GER)"},3,"-",1,null,null,null,null,"Luis Domingo L. Gutiérrez (ESP)"]
[29,{"$f":"'Individual Groups'!B36","v":"Patrizio Lazzaretti (ITA)"},{"$f":"'Individual Groups'!D36","v":"Justin Finch (ENG)"},3,"-",1,null,null,null,null,"Chris Aggelinas (GRE)"]
[30,{"$f":"'Individual Groups'!C36","v":"Gregg Deinhart (USA)"},{"$f":"'Individual Groups'!E36","v":"Guy Palmer (GIB)"},0,"-",1,null,null,null,null,"Hideaki Wada (JPN)"]
[31,{"$f":"'Individual Groups'!B37","v":"David Busch (AUT)"},{"$f":"'Individual Groups'!D37","v":"Juan Carlos Granados (ESP)"},2,"-",1,null,null,null,null,"Éric Naszalyi (FRA)"]
[32,{"$f":"'Individual Groups'!C37","v":"Massimo Cremona (MLT)"},{"$f":"'Individual Groups'!E37","v":"Vito Di Ruggiero (BEL)"},1,"-",0,null,null,null,null,"Rob Conway (SCO)"]
[33,{"$f":"'Individual Groups'!B45","v":"Delphine Dieudonne (BEL)"},{"$f":"'Individual Groups'!D45","v":"Mirjam de Jong (NED)"},5,"-",0,null,null,null,null,"Antonio Montaño (ESP)"]
[34,{"$f":"'Individual Groups'!C45","v":"Mélanie Falcone (BEL)"},{"$f":"'Individual Groups'!E45","v":"Helène Boniface (ITA)"},0,"-",1,null,null,null,null,"Patrick Dean (GIB)"]
[35,{"$f":"'Individual Groups'!B46","v":"Giulia Brillantino (ITA)"},{"$f":"'Individual Groups'!D46","v":"Daria Prazynski (GER)"},1,"-",0,null,null,null,null,"William Van den Houte (BEL)"]
[36,{"$f":"'Individual Groups'!C46","v":"Françoise Guyot (FRA)"},{"$f":"'Individual Groups'!E46","v":"Cynthia Bouchez (BEL)"},1,"-",1,null,null,null,null,"Elliott Bellefontaine (ENG)"]
[37,{"$f":"'Individual Groups'!B47","v":"Margault Delval (BEL)"},{"$f":"'Individual Groups'!D47","v":"Giuditta Lo Cascio (ITA)"},0,"-",3,null,null,null,null,"Arnaud Le Téno (FRA)"]
[38,{"$f":"'Individual Groups'!C47","v":"Isabelle Daelman (BEL)"},{"$f":"'Individual Groups'!E47","v":"Sylvie Guyot (FRA)"},0,"-",3,null,null,null,null,"Claudio Panebianco (ITA)"]
[39,{"$f":"'Individual Groups'!B54","v":"Nicola Borgo (ITA)"},{"$f":"'Individual Groups'!D54","v":"Jesús Moreno (ESP)"},3,"-",0,"ff",null,null,null,"Dario Passadore (USA)"]
[40,{"$f":"'Individual Groups'!C54","v":"Christopher Bowen (ENG)"},{"$f":"'Individual Groups'!E54","v":"Martin Antoine (BEL)"},2,"-",6,null,null,null,null,"Francesco Mattiangeli (ITA)"]
[41,{"$f":"'Individual Groups'!B55","v":"Steffen Despretz (BEL)"},{"$f":"'Individual Groups'!D55","v":"Nealmark Bonnici (MLT)"},6,"-",0,null,null,null,null,"Mat Atkin (ENG)"]
[42,{"$f":"'Individual Groups'!C55","v":"Andrea Ciccarelli (ITA)"},{"$f":"'Individual Groups'!E55","v":"Fabio Bianco (GER)"},4,"-",2,null,null,null,null,"Pascal Scheen (BEL)"]
[43,{"$f":"'Individual Groups'!B56","v":"Antonio Casin (ESP)"},{"$f":"'Individual Groups'!D56","v":"Théo Modeste (FRA)"},6,"-",3,null,null,null,null,"Florian Giaux (BEL)"]
[44,{"$f":"'Individual Groups'!C56","v":"Quentin Van Glabeke (BEL)"},{"$f":"'Individual Groups'!E56","v":"Ricardo Jose (POR)"},1,"-",0,null,null,null,null,"Connor Bowden (ENG)"]
[45,{"$f":"'Individual Groups'!B57","v":"Raphaël Pommier (FRA)"},{"$f":"'Individual Groups'!D57","v":"Afonso Pereira (POR)"},1,"-",1,null,null,null,null,"Jody Henrioul (BEL)"]
[46,{"$f":"'Individual Groups'!C57","v":"Corentin Wauthy (BEL)"},{"$f":"'Individual Groups'!E57","v":"Paolo Zambello (ITA)"},3,"-",6,null,null,null,null,"Andreas Jung (GER)"]
[47,{"$f":"'Individual Groups'!B65","v":"Corentin Bouchez (BEL)"},{"$f":"'Individual Groups'!D65","v":"Daniel Vranovitz (AUT)"},3,"-",2,null,null,null,null,"Panagiotis Haratsis (GRE)"]
[48,{"$f":"'Individual Groups'!C65","v":"Gonzalo García-Guereta (ESP)"},{"$f":"'Individual Groups'!E65","v":"Claudio La Torre (ITA)"},0,"-",5,null,null,null,null,"Frank Stiller (GER)"]
[49,{"$f":"'Individual Groups'!B66","v":"Jurgen Balzan (MLT)"},{"$f":"'Individual Groups'!D66","v":"Louison Giaux (BEL)"},3,"-",1,null,null,null,null,"Nikos Haratsis (GRE)"]
[50,{"$f":"'Individual Groups'!C66","v":"Yannick Matusch (GER)"},{"$f":"'Individual Groups'!E66","v":"Jorge Pinero (ESP)"},1,"-",0,null,null,null,null,"Carolina Villarigues (POR)"]
[51,{"$f":"'Individual Groups'!B67","v":"Leonardo Giudice (ITA)"},{"$f":"'Individual Groups'!D67","v":"Thomas Price (ENG)"},5,"-",0,null,null,null,null,"David González (ESP)"]
[52,{"$f":"'Individual Groups'!C67","v":"Niall Dean (GIB)"},{"$f":"'Individual Groups'!E67","v":"Corentin Boltz (BEL)"},2,"-",2,null,null,null,null,"Paula Maireles  (ESP)"]
[53,{"$f":"'Individual Groups'!B68","v":"Alwin Krause (GER)"},{"$f":"'Individual Groups'!D68","v":"Eliott Legall (FRA)"},4,"-",1,null,null,null,null,"Nathan Dizier (BEL)"]
[54,{"$f":"'Individual Groups'!C68","v":"Antonio García Fernández (ESP)"},{"$f":"'Individual Groups'!E68","v":"Jonathan Nichtenberger (AUT)"},6,"-",3,null,null,null,null,"Eleonora Buttitta (ITA)"]
[55,{"$f":"'Individual Groups'!B76","v":"Basile Magermans (BEL)"},{"$f":"'Individual Groups'!D76","v":"Diogo Pereira (POR)"},4,"-",1,null,null,null,null,"Audrey Herbaut (FRA)"]
[56,{"$f":"'Individual Groups'!C76","v":"Léa Despretz (BEL)"},{"$f":"'Individual Groups'!E76","v":"Carlos Pinto (ESP)"},0,"-",5,null,null,null,null,"Conny Vulpes (GER)"]
[57,{"$f":"'Individual Groups'!B77","v":"Riccardo Natoli (ITA)"},{"$f":"'Individual Groups'!D77","v":"Conor Atkin (ENG)"},5,"-",0,null,null,null,null,"Victoria Büsing (GER)"]
[58,{"$f":"'Individual Groups'!C77","v":"Jann Segers (BEL)"},{"$f":"'Individual Groups'!E77","v":"Quentin Ausset (FRA)"},0,"-",2,null,null,null,null,"Julia Eglicerio (ESP)"]
[59,"Arbitres",null,null,"-"]
[60,"réservistes",null,null,"-"]
[]
[]
["Série 5 - 12h40"]
[]
["Tables"]
[null,null,null,null,null,null,null,null,null,null,null,"Referees"]
[]
[1,{"$f":"'Individual Groups'!E3","v":"Rémi Soret (FRA)"},{"$f":"'Individual Groups'!B3","v":"Juan Manuel Noguera (ESP)"},2,"-",4,null,null,null,null,"Angelo Borg (MLT)"]
[2,{"$f":"'Individual Groups'!C3","v":"Daniel Cranston (USA)"},{"$f":"'Individual Groups'!D3","v":"Andrew Abela (MLT)"},4,"-",1,null,null,null,null,"Sérgio Ramos (POR)"]
[3,{"$f":"'Individual Groups'!E4","v":"Brett Price (ENG)"},{"$f":"'Individual Groups'!B4","v":"Saverio Bari (ITA)"},0,"-",10,null,null,null,null,"Dmitry L. Valeriavitch (RUS)"]
[4,{"$f":"'Individual Groups'!C4","v":"Jean-Guillaume Einsle (FRA)"},{"$f":"'Individual Groups'!D4","v":"Janus Gersie (GER)"},5,"-",1,null,null,null,null,"Bessim Golger (BEL)"]
[5,{"$f":"'Individual Groups'!E5","v":"Malcolm Lees (SCO)"},{"$f":"'Individual Groups'!B5","v":"Luca Colangelo (ITA)"},0,"-",9,null,null,null,null,"Anton V. Aleksadrovich (RUS)"]
[6,{"$f":"'Individual Groups'!C5","v":"Francis Avellano (GIB)"},{"$f":"'Individual Groups'!D5","v":"Terry Arnold (ENG)"},5,"-",3,null,null,null,null,"Mike Tillman (USA)"]
[7,{"$f":"'Individual Groups'!E6","v":"Patrick Sheridan (USA)"},{"$f":"'Individual Groups'!B6","v":"Daniele Bertelli (ITA)"},2,"-",10,null,null,null,null,"Suguru Fujino (JPN)"]
[8,{"$f":"'Individual Groups'!C6","v":"José David Somoza (ESP)"},{"$f":"'Individual Groups'!D6","v":"Lazaros Papakonstantinou (GRE)"},1,"-",3,null,null,null,null,"Lawrence Alvarez (GIB)"]
[9,{"$f":"'Individual Groups'!E7","v":"Giorgos Koutis (GRE)"},{"$f":"'Individual Groups'!B7","v":"Massimiliano Nastasi (ITA)"},3,"-",2,null,null,null,null,"Rémy Huynh (BEL)"]
[10,{"$f":"'Individual Groups'!C7","v":"Marcel Kwiatkowski (GER)"},{"$f":"'Individual Groups'!D7","v":"Wolfgang Leitner (AUT)"},5,"-",5,null,null,null,null,"Christian Filippella (USA)"]
[11,{"$f":"'Individual Groups'!E8","v":"Jean-Marie Amberny (FRA)"},{"$f":"'Individual Groups'!B8","v":"Christian Haas (AUT)"},2,"-",3,null,null,null,null,"Kostas Seses (GRE)"]
[12,{"$f":"'Individual Groups'!C8","v":"Luca Zambello (ITA)"},{"$f":"'Individual Groups'!D8","v":"Sami Targui (BEL)"},1,"-",2,null,null,null,null,"Axel Donval (FRA)"]
[13,{"$f":"'Individual Groups'!E9","v":"Thomas Wittmann (AUT)"},{"$f":"'Individual Groups'!B9","v":"Spyros Hatzaras (GRE)"},0,"-",0,null,null,null,null,"Nuno Henriques (POR)"]
[14,{"$f":"'Individual Groups'!C9","v":"Alexander Ruf (GER)"},{"$f":"'Individual Groups'!D9","v":"Fayçal Rouis (FRA)"},0,"-",0,null,null,null,null,"Luca Martinelli (ENG)"]
[15,{"$f":"'Individual Groups'!E10","v":"Romain Lafontaine (FRA)"},{"$f":"'Individual Groups'!B10","v":"Alexander Haas (AUT)"},2,"-",2,null,null,null,null,"Derek Conti (MLT)"]
[16,{"$f":"'Individual Groups'!C10","v":"Valéry Dejardin (BEL)"},{"$f":"'Individual Groups'!D10","v":"Frank Hagenkötter (GER)"},4,"-",1,null,null,null,null,"Gareth Christie (SCO)"]
[17,{"$f":"'Individual Groups'!E22","v":"Francesco Mattiangeli (ITA)"},{"$f":"'Individual Groups'!B22","v":"Antonio Montaño (ESP)"},1,"-",1,null,null,null,null,"Spyros Patrinos (GRE)"]
[18,{"$f":"'Individual Groups'!C22","v":"Patrick Dean (GIB)"},{"$f":"'Individual Groups'!D22","v":"Dario Passadore (USA)"},1,"-",2,null,null,null,null,"Wolfgang Haas (AUT)"]
[19,{"$f":"'Individual Groups'!E23","v":"Andreas Jung (GER)"},{"$f":"'Individual Groups'!B23","v":"Pascal Scheen (BEL)"},2,"-",4,null,null,null,null,"Luis Abreu (POR)"]
[20,{"$f":"'Individual Groups'!C23","v":"Mat Atkin (ENG)"},{"$f":"'Individual Groups'!D23","v":"Panagiotis Haratsis (GRE)"},0,"-",5,null,null,null,null,"Maikel de Haas (NED)"]
[21,{"$f":"'Individual Groups'!E24","v":"Paul Eyes (USA)"},{"$f":"'Individual Groups'!B24","v":"Vicenç Prats Salat (ESP)"},1,"-",4,null,null,null,null,"Kostas Stamokostas (GRE)"]
[22,{"$f":"'Individual Groups'!C24","v":"Frank Stiller (GER)"},{"$f":"'Individual Groups'!D24","v":"Henk Landzaat (NED)"},4,"-",1,null,null,null,null,"Brian Daley (ENG)"]
[23,{"$f":"'Individual Groups'!E25","v":"Jeremy Bradley (ENG)"},{"$f":"'Individual Groups'!B25","v":"Daniel Scheen (BEL)"},0,"-",1,null,null,null,null,"Raffaele Lombardi (AUS)"]
[24,{"$f":"'Individual Groups'!C25","v":"Karl-Heinz Haider (AUT)"},{"$f":"'Individual Groups'!D25","v":"Richard Berllaque (GIB)"},5,"-",0,null,null,null,null,"Rainer Vogt (GER)"]
[25,{"$f":"'Individual Groups'!E26","v":"Phil Redman (ENG)"},{"$f":"'Individual Groups'!B26","v":"Günther Bamberzky (AUT)"},0,"-",2,null,null,null,null,"Eric Threis (BEL)"]
[26,{"$f":"'Individual Groups'!C26","v":"Xavier Dubois (FRA)"},{"$f":"'Individual Groups'!D26","v":"Paul O’Donovan Rossa (USA)"},1,"-",0,null,null,null,null,"Tom Horn (GER)"]
[27,{"$f":"'Individual Groups'!E27","v":"Andrey K. Nicolaevich (RUS)"},{"$f":"'Individual Groups'!B27","v":"Gianfranco Calonico (ITA)"},0,"-",5,null,null,null,null,"Giorgos Aggelinas (GRE)"]
[28,{"$f":"'Individual Groups'!C27","v":"Arturo Martínez (ESP)"},{"$f":"'Individual Groups'!D27","v":"Axel Modeste (FRA)"},0,"-",0,null,null,null,null,"John Zammit (MLT)"]
[29,{"$f":"'Individual Groups'!E28","v":"Luis Domingo L. Gutiérrez (ESP)"},{"$f":"'Individual Groups'!B28","v":"Erich Hinkelmann (AUT)"},1,"-",3,null,null,null,null,"Alain Jadot (BEL)"]
[30,{"$f":"'Individual Groups'!C28","v":"Davide Lazzari (CZE)"},{"$f":"'Individual Groups'!D28","v":"Benoît Massart (BEL)"},1,"-",2,null,null,null,null,"Ferrán Coll (ESP)"]
[31,{"$f":"'Individual Groups'!E29","v":"Rob Conway (SCO)"},{"$f":"'Individual Groups'!B29","v":"Chris Aggelinas (GRE)"},0,"-",6,null,null,null,null,"Robert Green (AUS)"]
[32,{"$f":"'Individual Groups'!C29","v":"Éric Naszalyi (FRA)"},{"$f":"'Individual Groups'!D29","v":"Hideaki Wada (JPN)"},9,"-",1,null,null,null,null,"Jose Luis Bonavia (GIB)"]
[33,{"$f":"'Individual Groups'!E41","v":"Elodie Bertholet (BEL)"},{"$f":"'Individual Groups'!B41","v":"Paola Forlani (ITA)"},2,"-",2,null,null,null,null,"Manfred Pawlica (AUT)"]
[34,{"$f":"'Individual Groups'!C41","v":"Maike Krause (GER)"},{"$f":"'Individual Groups'!D41","v":"Lydie Pinchart (BEL)"},0,"-",3,null,null,null,null,"Stefano De Francesco (ITA)"]
[35,{"$f":"'Individual Groups'!E42","v":"Eleonora Buttitta (ITA)"},{"$f":"'Individual Groups'!B42","v":"Emilie Despretz (BEL)"},3,"-",2,null,null,null,null,"Thierry Vivron (FRA)"]
[36,{"$f":"'Individual Groups'!C42","v":"Arielle Briant (FRA)"},{"$f":"'Individual Groups'!D42","v":"Paula Maireles  (ESP)"},1,"-",2,null,null,null,null,"Martin Antoine (BEL)"]
[37,{"$f":"'Individual Groups'!E43","v":"Conny Vulpes (GER)"},{"$f":"'Individual Groups'!B43","v":"Audrey Herbaut (FRA)"},0,"-",5,null,null,null,null,"Steffen Despretz (BEL)"]
[38,{"$f":"'Individual Groups'!C43","v":"Alyssa Guyaux (BEL)"},{"$f":"'Individual Groups'!D43","v":"Julia Eglicerio (ESP)"},0,"-",0,null,null,null,null,"Arnold Mair (GER)"]
[39,{"$f":"'Individual Groups'!E44","v":"Kimberley Devreese (BEL)"},{"$f":"'Individual Groups'!B44","v":"Victoria Büsing (GER)"},0,"-",5,null,null,null,null,"Théo Modeste (FRA)"]
[40,{"$f":"'Individual Groups'!C44","v":"Carolina Villarigues (POR)"},{"$f":"'Individual Groups'!D44","v":"Manon Willem (BEL)"},3,"-",0,null,null,null,null,"Andrea Ciccarelli (ITA)"]
[41,{"$f":"'Individual Groups'!B58","v":"Elliott Bellefontaine (ENG)"},{"$f":"'Individual Groups'!D58","v":"Claudio Panebianco (ITA)"},3,"-",8,null,null,null,null,"Gregg Deinhart (USA)"]
[42,{"$f":"'Individual Groups'!C58","v":"William Van den Houte (BEL)"},{"$f":"'Individual Groups'!E58","v":"Arnaud Le Téno (FRA)"},8,"-",4,null,null,null,null,"Patrizio Lazzaretti (ITA)"]
[43,{"$f":"'Individual Groups'!B59","v":"Matteo Ciccarelli (ITA)"},{"$f":"'Individual Groups'!D59","v":"Maxime Muraille (BEL)"},0,"-",0,null,null,null,null,"Guy Palmer (GIB)"]
[44,{"$f":"'Individual Groups'!C59","v":"Kai Hagenkötter (GER)"},{"$f":"'Individual Groups'!E59","v":"Paul Naszalyi (FRA)"},4,"-",0,null,null,null,null,"Vito Di Ruggiero (BEL)"]
[45,{"$f":"'Individual Groups'!E52","v":"Nikos Haratsis (GRE)"},{"$f":"'Individual Groups'!B52","v":"Florian Giaux (BEL)"},4,"-",7,null,null,null,null,"David Busch (AUT)"]
[46,{"$f":"'Individual Groups'!C52","v":"Jody Henrioul (BEL)"},{"$f":"'Individual Groups'!D52","v":"Connor Bowden (ENG)"},1,"-",0,null,null,null,null,"Juan Carlos Granados (ESP)"]
[47,{"$f":"'Individual Groups'!E53","v":"Marco Di Vito (ITA)"},{"$f":"'Individual Groups'!B53","v":"David González (ESP)"},13,"-",2,null,null,null,null,"Massimo Cremona (MLT)"]
[48,{"$f":"'Individual Groups'!C53","v":"Nathan Dizier (BEL)"},{"$f":"'Individual Groups'!D53","v":"Koshiro Shibata (JPN)"},6,"-",0,null,null,null,null,"Justin Finch (ENG)"]
[49,{"$f":"'Individual Groups'!B69","v":"Kye Arnold (ENG)"},{"$f":"'Individual Groups'!D69","v":"Antonio La Torre (ITA)"},0,"-",5,null,null,null,null,"Quentin Van Glabeke (BEL)"]
[50,{"$f":"'Individual Groups'!C69","v":"Moritz Jung (GER)"},{"$f":"'Individual Groups'!E69","v":"Paul Offmann (FRA)"},5,"-",0,null,null,null,null,"Corentin Wauthy (BEL)"]
[51,{"$f":"'Individual Groups'!B70","v":"Lukas Eppensteiner (AUT)"},{"$f":"'Individual Groups'!D70","v":"Rhys Williams (ENG)"},3,"-",0,null,null,null,null,"Fabio Bianco (GER)"]
[52,{"$f":"'Individual Groups'!C70","v":"Matteo Brillantino (ITA)"},{"$f":"'Individual Groups'!E70","v":"Mathéo Grégoire (BEL)"},3,"-",0,null,null,null,null,"Nealmark Bonnici (MLT)"]
[53,{"$f":"'Individual Groups'!B78","v":"Francesco Tozzi (ITA)"},{"$f":"'Individual Groups'!D78","v":"Noah Denne (BEL)"},5,"-",0,null,null,null,null,"Antonio Casin (ESP)"]
[54,{"$f":"'Individual Groups'!C78","v":"Gabriel Lombardi (AUS)"},{"$f":"'Individual Groups'!E78","v":"Jesús Maireles (ESP)"},0,"-",3,"ff",null,null,null,"Jesús Moreno (ESP)"]
[55,{"$f":"'Individual Groups'!B79","v":"Giorgio Giudice (ITA)"},{"$f":"'Individual Groups'!D79","v":"Mark Offmann (FRA)"},5,"-",0,null,null,null,null,"Ricardo Jose (POR)"]
[56,{"$f":"'Individual Groups'!C79","v":"Joseph Agius (MLT)"},{"$f":"'Individual Groups'!E79","v":"Alex Genart (BEL)"},2,"-",4,null,null,null,null,"Paolo Zambello (ITA)"]
[57,{"$f":"'Individual Groups'!B80","v":"Joshua Foreman (ENG)"},{"$f":"'Individual Groups'!D80","v":"Cristian Fricano  (ITA)"},2,"-",3,null,null,null,null,"Raphaël Pommier (FRA)"]
[58,{"$f":"'Individual Groups'!C80","v":"Kristian Silagiev (ESP)"},{"$f":"'Individual Groups'!E80","v":"Aurélien Feye (BEL)"},4,"-",0,null,null,null,null,"Afonso Pereira (POR)"]
[59,"Arbitres",null,null,"-"]
[60,"réservistes",null,null,"-"]
[]
[]
["Série 6 - 13h35"]
[]
["Tables"]
[null,null,null,null,null,null,null,null,null,null,null,"Referees"]
[]
[1,{"$f":"'Individual Groups'!E11","v":"Velissarios Fragakis (GRE)"},{"$f":"'Individual Groups'!B11","v":"Sébastien Scheen (BEL)"},3,"-",3,null,null,null,null,"José David Somoza (ESP)"]
[2,{"$f":"'Individual Groups'!C11","v":"Heinz Eder (AUT)"},{"$f":"'Individual Groups'!D11","v":"Julio Candélas (ESP)"},3,"-",1,null,null,null,null,"Daniele Bertelli (ITA)"]
[3,{"$f":"'Individual Groups'!E12","v":"Massimo Bolognino (ITA)"},{"$f":"'Individual Groups'!B12","v":"Justin Leroy (BEL)"},2,"-",1,null,null,null,null,"Lazaros Papakonstantinou (GRE)"]
[4,{"$f":"'Individual Groups'!C12","v":"Marcus Tilgner (GER)"},{"$f":"'Individual Groups'!D12","v":"Juan Carlos Pinto (ESP)"},8,"-",1,null,null,null,null,"Patrick Sheridan (USA)"]
[5,{"$f":"'Individual Groups'!E13","v":"Raffaele Lombardi (AUS)"},{"$f":"'Individual Groups'!B13","v":"Christophe Dheur (BEL)"},1,"-",6,null,null,null,null,"Massimiliano Nastasi (ITA)"]
[6,{"$f":"'Individual Groups'!C13","v":"Jonathan Dotto (GIB)"},{"$f":"'Individual Groups'!D13","v":"Kostas Stamokostas (GRE)"},0,"-",3,null,null,null,null,"Marcel Kwiatkowski (GER)"]
[7,{"$f":"'Individual Groups'!E14","v":"Mike Tillman (USA)"},{"$f":"'Individual Groups'!B14","v":"Angelo Borg (MLT)"},0,"-",4,null,null,null,null,"Wolfgang Leitner (AUT)"]
[8,{"$f":"'Individual Groups'!C14","v":"Suguru Fujino (JPN)"},{"$f":"'Individual Groups'!D14","v":"Bessim Golger (BEL)"},1,"-",4,null,null,null,null,"Giorgos Koutis (GRE)"]
[9,{"$f":"'Individual Groups'!E15","v":"Christian Filippella (USA)"},{"$f":"'Individual Groups'!B15","v":"Sérgio Ramos (POR)"},1,"-",3,null,null,null,null,"Christian Haas (AUT)"]
[10,{"$f":"'Individual Groups'!C15","v":"Lawrence Alvarez (GIB)"},{"$f":"'Individual Groups'!D15","v":"Rémy Huynh (BEL)"},0,"-",10,null,null,null,null,"Luca Zambello (ITA)"]
[11,{"$f":"'Individual Groups'!E16","v":"Luca Martinelli (ENG)"},{"$f":"'Individual Groups'!B16","v":"Kostas Seses (GRE)"},0,"-",2,null,null,null,null,"Jean-Marie Amberny (FRA)"]
[12,{"$f":"'Individual Groups'!C16","v":"Axel Donval (FRA)"},{"$f":"'Individual Groups'!D16","v":"Nuno Henriques (POR)"},6,"-",0,null,null,null,null,"Sami Targui (BEL)"]
[13,{"$f":"'Individual Groups'!E17","v":"Spyros Patrinos (GRE)"},{"$f":"'Individual Groups'!B17","v":"Derek Conti (MLT)"},3,"-",3,null,null,null,null,"Alexander Ruf (GER)"]
[14,{"$f":"'Individual Groups'!C17","v":"Anton V. Aleksadrovich (RUS)"},{"$f":"'Individual Groups'!D17","v":"Gareth Christie (SCO)"},0,"-",14,null,null,null,null,"Spyros Hatzaras (GRE)"]
[15,{"$f":"'Individual Groups'!E18","v":"Maikel de Haas (NED)"},{"$f":"'Individual Groups'!B18","v":"Wolfgang Haas (AUT)"},4,"-",4,null,null,null,null,"Fayçal Rouis (FRA)"]
[16,{"$f":"'Individual Groups'!C18","v":"Dmitry L. Valeriavitch (RUS)"},{"$f":"'Individual Groups'!D18","v":"Luis Abreu (POR)"},0,"-",9,null,null,null,null,"Thomas Wittmann (AUT)"]
[17,{"$f":"'Individual Groups'!E30","v":"Massimiliano Croatti (ITA)"},{"$f":"'Individual Groups'!B30","v":"John Field (GIB)"},1,"-",3,null,null,null,null,"Alexander Haas (AUT)"]
[18,{"$f":"'Individual Groups'!C30","v":"Giorgos Drazinakis (GRE)"},{"$f":"'Individual Groups'!D30","v":"Patrick de Jong (NED)"},0,"-",3,null,null,null,null,"Valéry Dejardin (BEL)"]
[19,{"$f":"'Individual Groups'!E31","v":"Marco Zucchi (CZE)"},{"$f":"'Individual Groups'!B31","v":"Jason Pisani (MLT)"},1,"-",2,null,null,null,null,"Romain Lafontaine (FRA)"]
[20,{"$f":"'Individual Groups'!C31","v":"Dimitris Stamatopoulos (GRE)"},{"$f":"'Individual Groups'!D31","v":"Stéphane Pommier (FRA)"},3,"-",1,null,null,null,null,"Frank Hagenkötter (GER)"]
[21,{"$f":"'Individual Groups'!E32","v":"Rainer Vogt (GER)"},{"$f":"'Individual Groups'!B32","v":"Charles Aquilina (MLT)"},1,"-",5,null,null,null,null,"Malcolm Lees (SCO)"]
[22,{"$f":"'Individual Groups'!C32","v":"Andy Beskaby (SCO)"},{"$f":"'Individual Groups'!D32","v":"Brian Daley (ENG)"},5,"-",3,null,null,null,null,"Henk Landzaat (NED)"]
[23,{"$f":"'Individual Groups'!E33","v":"John Zammit (MLT)"},{"$f":"'Individual Groups'!B33","v":"Eric Threis (BEL)"},0,"-",1,null,null,null,null,"Terry Arnold (ENG)"]
[24,{"$f":"'Individual Groups'!C33","v":"Tom Horn (GER)"},{"$f":"'Individual Groups'!D33","v":"Giorgos Aggelinas (GRE)"},1,"-",4,null,null,null,null,"Daniel Scheen (BEL)"]
[25,{"$f":"'Individual Groups'!E34","v":"Jose Luis Bonavia (GIB)"},{"$f":"'Individual Groups'!B34","v":"Alain Jadot (BEL)"},0,"-",2,null,null,null,null,"Paul Eyes (USA)"]
[26,{"$f":"'Individual Groups'!C34","v":"Ferrán Coll (ESP)"},{"$f":"'Individual Groups'!D34","v":"Robert Green (AUS)"},3,"-",1,null,null,null,null,"Karl-Heinz Haider (AUT)"]
[27,{"$f":"'Individual Groups'!E35","v":"Arnold Mair (GER)"},{"$f":"'Individual Groups'!B35","v":"Manfred Pawlica (AUT)"},0,"-",0,null,null,null,null,"Richard Berllaque (GIB)"]
[28,{"$f":"'Individual Groups'!C35","v":"Stefano De Francesco (ITA)"},{"$f":"'Individual Groups'!D35","v":"Thierry Vivron (FRA)"},3,"-",3,null,null,null,null,"Jeremy Bradley (ENG)"]
[29,{"$f":"'Individual Groups'!E36","v":"Guy Palmer (GIB)"},{"$f":"'Individual Groups'!B36","v":"Patrizio Lazzaretti (ITA)"},1,"-",4,null,null,null,null,"Günther Bamberzky (AUT)"]
[30,{"$f":"'Individual Groups'!C36","v":"Gregg Deinhart (USA)"},{"$f":"'Individual Groups'!D36","v":"Justin Finch (ENG)"},1,"-",4,null,null,null,null,"Xavier Dubois (FRA)"]
[31,{"$f":"'Individual Groups'!E37","v":"Vito Di Ruggiero (BEL)"},{"$f":"'Individual Groups'!B37","v":"David Busch (AUT)"},3,"-",4,null,null,null,null,"Paul O’Donovan Rossa (USA)"]
[32,{"$f":"'Individual Groups'!C37","v":"Massimo Cremona (MLT)"},{"$f":"'Individual Groups'!D37","v":"Juan Carlos Granados (ESP)"},5,"-",1,null,null,null,null,"Gianfranco Calonico (ITA)"]
[33,{"$f":"'Individual Groups'!E45","v":"Helène Boniface (ITA)"},{"$f":"'Individual Groups'!B45","v":"Delphine Dieudonne (BEL)"},1,"-",5,null,null,null,null,"Phil Redman (ENG)"]
[34,{"$f":"'Individual Groups'!C45","v":"Mélanie Falcone (BEL)"},{"$f":"'Individual Groups'!D45","v":"Mirjam de Jong (NED)"},1,"-",0,null,null,null,null,"Arturo Martínez (ESP)"]
[35,{"$f":"'Individual Groups'!E46","v":"Cynthia Bouchez (BEL)"},{"$f":"'Individual Groups'!B46","v":"Giulia Brillantino (ITA)"},0,"-",1,null,null,null,null,"Axel Modeste (FRA)"]
[36,{"$f":"'Individual Groups'!C46","v":"Françoise Guyot (FRA)"},{"$f":"'Individual Groups'!D46","v":"Daria Prazynski (GER)"},2,"-",1,null,null,null,null,"Benoît Massart (BEL)"]
[37,{"$f":"'Individual Groups'!E47","v":"Sylvie Guyot (FRA)"},{"$f":"'Individual Groups'!B47","v":"Margault Delval (BEL)"},2,"-",2,null,null,null,null,"Erich Hinkelmann (AUT)"]
[38,{"$f":"'Individual Groups'!C47","v":"Isabelle Daelman (BEL)"},{"$f":"'Individual Groups'!D47","v":"Giuditta Lo Cascio (ITA)"},0,"-",5,null,null,null,null,"Andrey K. Nicolaevich (RUS)"]
[39,{"$f":"'Individual Groups'!E54","v":"Martin Antoine (BEL)"},{"$f":"'Individual Groups'!B54","v":"Nicola Borgo (ITA)"},3,"-",3,null,null,null,null,"Luis Domingo L. Gutiérrez (ESP)"]
[40,{"$f":"'Individual Groups'!C54","v":"Christopher Bowen (ENG)"},{"$f":"'Individual Groups'!D54","v":"Jesús Moreno (ESP)"},3,"-",0,"ff",null,null,null,"Raphaël Pommier (FRA)"]
[41,{"$f":"'Individual Groups'!E55","v":"Fabio Bianco (GER)"},{"$f":"'Individual Groups'!B55","v":"Steffen Despretz (BEL)"},0,"-",4,null,null,null,null,"Davide Lazzari (CZE)"]
[42,{"$f":"'Individual Groups'!C55","v":"Andrea Ciccarelli (ITA)"},{"$f":"'Individual Groups'!D55","v":"Nealmark Bonnici (MLT)"},5,"-",0,null,null,null,null,"Chris Aggelinas (GRE)"]
[43,{"$f":"'Individual Groups'!E63","v":"Adam Kraus (AUT)"},{"$f":"'Individual Groups'!B63","v":"Maxime Rairoux (BEL)"},0,"-",5,null,null,null,null,"Éric Naszalyi (FRA)"]
[44,{"$f":"'Individual Groups'!C63","v":"Florentine Ausset (FRA)"},{"$f":"'Individual Groups'!D63","v":"Riccardo Lazzari (ITA)"},0,"-",5,null,null,null,null,"Hideaki Wada (JPN)"]
[45,{"$f":"'Individual Groups'!E64","v":"Manuel Politz (GER)"},{"$f":"'Individual Groups'!B64","v":"Marios Strommer (AUT)"},0,"-",5,null,null,null,null,"Rob Conway (SCO)"]
[46,{"$f":"'Individual Groups'!C64","v":"Andrea Bolognino (ITA)"},{"$f":"'Individual Groups'!D64","v":"Vasco Henriques (POR)"},4,"-",2,null,null,null,null,"Koshiro Shibata (JPN)"]
[47,{"$f":"'Individual Groups'!E65","v":"Claudio La Torre (ITA)"},{"$f":"'Individual Groups'!B65","v":"Corentin Bouchez (BEL)"},5,"-",0,null,null,null,null,"Afonso Pereira (POR)"]
[48,{"$f":"'Individual Groups'!C65","v":"Gonzalo García-Guereta (ESP)"},{"$f":"'Individual Groups'!D65","v":"Daniel Vranovitz (AUT)"},0,"-",5,null,null,null,null,"Maxime Muraille (BEL)"]
[49,{"$f":"'Individual Groups'!E66","v":"Jorge Pinero (ESP)"},{"$f":"'Individual Groups'!B66","v":"Jurgen Balzan (MLT)"},0,"-",5,null,null,null,null,"Corentin Wauthy (BEL)"]
[50,{"$f":"'Individual Groups'!C66","v":"Yannick Matusch (GER)"},{"$f":"'Individual Groups'!D66","v":"Louison Giaux (BEL)"},0,"-",4,null,null,null,null,"Paolo Zambello (ITA)"]
[51,{"$f":"'Individual Groups'!E74","v":"Charlotte Bouchez (BEL)"},{"$f":"'Individual Groups'!B74","v":"Matteo Cammarata (ITA)"},0,"-",4,null,null,null,null,"David Vantassel"]
[52,{"$f":"'Individual Groups'!C74","v":"Victor Dubuc (FRA)"},{"$f":"'Individual Groups'!D74","v":"Jérôme Cyganek (BEL)"},1,"-",1,null,null,null,null,"Matteo Ciccarelli (ITA)"]
[53,{"$f":"'Individual Groups'!E75","v":"Mattia Ferrante (ITA)"},{"$f":"'Individual Groups'!B75","v":"Lucas Pere (BEL)"},2,"-",0,null,null,null,null,"Kai Hagenkötter (GER)"]
[54,{"$f":"'Individual Groups'!C75","v":"Lucie Baudour (BEL)"},{"$f":"'Individual Groups'!D75","v":"Louis Fouetillou (FRA)"},0,"-",1,null,null,null,null,"Paula Maireles  (ESP)"]
[55,{"$f":"'Individual Groups'!E76","v":"Carlos Pinto (ESP)"},{"$f":"'Individual Groups'!B76","v":"Basile Magermans (BEL)"},0,"-",2,null,null,null,null,"Paul Naszalyi (FRA)"]
[56,{"$f":"'Individual Groups'!C76","v":"Léa Despretz (BEL)"},{"$f":"'Individual Groups'!D76","v":"Diogo Pereira (POR)"},0,"-",3,null,null,null,null,"Eleonora Buttitta (ITA)"]
[57,{"$f":"'Individual Groups'!E77","v":"Quentin Ausset (FRA)"},{"$f":"'Individual Groups'!B77","v":"Riccardo Natoli (ITA)"},2,"-",2,null,null,null,null,"Elodie Bertholet (BEL)"]
[58,{"$f":"'Individual Groups'!C77","v":"Jann Segers (BEL)"},{"$f":"'Individual Groups'!D77","v":"Conor Atkin (ENG)"},4,"-",0,null,null,null,null,"Marco Di Vito (ITA)"]
[59,"Arbitres",null,null,"-"]
[60,"réservistes",null,null,"-"]
[]
[]
["Série 7 - 14h45"]
[]
["Tables"]
[null,null,null,null,null,null,null,null,null,null,null,"Referees"]
[]
[null,"Last 32 Open"]
[]
[1,{"$f":"'Individual Groups'!Q91","v":"Juan Manuel Noguera (ESP)"},{"$f":"'Individual Groups'!Q218","v":"Spyros Patrinos (GRE)"},3,"-",2,null,null,null,null,"Marcus Tilgner (GER)",{"$f":"'Individual Groups'!Q165","v":"Velissarios Fragakis (GRE)"},null,"L32 O1","1er gr. 1","2ème gr. 15"]
[2,{"$f":"'Individual Groups'!Q101","v":"Jean-Guillaume Einsle (FRA)"},{"$f":"'Individual Groups'!Q226","v":"Maikel de Haas (NED)"},2,"-",4,null,null,null,null,"Velissarios Fragakis (GRE)",{"$f":"'Individual Groups'!Q174","v":"Marcus Tilgner (GER)"},null,"L32 O2","2ème gr. 2","1er gr. 16"]
[3,{"$f":"'Individual Groups'!Q163","v":"Sébastien Scheen (BEL)"},{"$f":"'Individual Groups'!Q146","v":"Alexander Ruf (GER)"},1,"-",0,"sd",null,null,null,"Thierry Vivron (FRA)",{"$f":"'Individual Groups'!Q183","v":"Raffaele Lombardi (AUS)"},null,"L32 O3","1er gr. 9","2ème gr. 7"]
[4,{"$f":"'Individual Groups'!Q173","v":"Justin Leroy (BEL)"},{"$f":"'Individual Groups'!Q154","v":"Alexander Haas (AUT)"},1,"-",1,null,1,3,null,"Henk Landzaat (NED)",{"$f":"'Individual Groups'!Q192","v":"Mike Tillman (USA)"},null,"L32 O4","2ème gr. 10","1er gr. 8"]
[5,{"$f":"'Individual Groups'!Q127","v":"Wolfgang Leitner (AUT)"},{"$f":"'Individual Groups'!Q182","v":"Kostas Stamokostas (GRE)"},2,"-",0,null,null,null,null,"Christian Filippella (USA)",{"$f":"'Individual Groups'!Q201","v":"Christian Filippella (USA)"},null,"L32 O5","1er gr. 5","2ème gr. 11"]
[6,{"$f":"'Individual Groups'!Q137","v":"Luca Zambello (ITA)"},{"$f":"'Individual Groups'!Q190","v":"Bessim Golger (BEL)"},5,"-",2,null,null,null,null,"Luca Martinelli (ENG)",{"$f":"'Individual Groups'!Q210","v":"Luca Martinelli (ENG)"},null,"L32 O6","2ème gr. 6","1er gr. 12"]
[7,{"$f":"'Individual Groups'!Q199","v":"Rémy Huynh (BEL)"},{"$f":"'Individual Groups'!Q110","v":"Malcolm Lees (SCO)"},7,"-",0,null,null,null,null,"Luis Abreu (POR)",{"$f":"'Individual Groups'!Q219","v":"Gareth Christie (SCO)"},null,"L32 O7","1er gr. 13","2ème gr. 3"]
[8,{"$f":"'Individual Groups'!Q209","v":"Kostas Seses (GRE)"},{"$f":"'Individual Groups'!Q118","v":"Daniele Bertelli (ITA)"},0,"-",3,null,null,null,null,"Gareth Christie (SCO)",{"$f":"'Individual Groups'!Q228","v":"Luis Abreu (POR)"},null,"L32 O8","2ème gr. 14","1er gr. 4"]
[9,{"$f":"'Individual Groups'!Q109","v":"Luca Colangelo (ITA)"},{"$f":"'Individual Groups'!Q200","v":"Sérgio Ramos (POR)"},4,"-",2,null,null,null,null,"Daniel Cranston (USA)",{"$f":"'Individual Groups'!Q93","v":"Daniel Cranston (USA)"},null,"L32 O9","1er gr. 3","2ème gr. 13"]
[10,{"$f":"'Individual Groups'!Q119","v":"Lazaros Papakonstantinou (GRE)"},{"$f":"'Individual Groups'!Q208","v":"Axel Donval (FRA)"},4,"-",5,"sd",null,null,null,"Janus Gersie (GER)",{"$f":"'Individual Groups'!Q102","v":"Janus Gersie (GER)"},null,"L32 O10","2ème gr. 4","1er  gr. 14"]
[11,{"$f":"'Individual Groups'!Q181","v":"Christophe Dheur (BEL)"},{"$f":"'Individual Groups'!Q128","v":"Giorgos Koutis (GRE)"},1,"-",0,null,null,null,null,"Francis Avellano (GIB)",{"$f":"'Individual Groups'!Q111","v":"Francis Avellano (GIB)"},null,"L32 O11","1er gr. 11","2ème gr. 5"]
[12,{"$f":"'Individual Groups'!Q191","v":"Angelo Borg (MLT)"},{"$f":"'Individual Groups'!Q136","v":"Sami Targui (BEL)"},1,"-",3,null,null,null,null,"Patrick Sheridan (USA)",{"$f":"'Individual Groups'!Q120","v":"Patrick Sheridan (USA)"},null,"L32 O12","2ème gr. 12","1er gr. 6"]
[13,{"$f":"'Individual Groups'!Q145","v":"Spyros Hatzaras (GRE)"},{"$f":"'Individual Groups'!Q164","v":"Heinz Eder (AUT)"},3,"-",2,"sd",null,null,null,"Massimiliano Nastasi (ITA)",{"$f":"'Individual Groups'!Q129","v":"Massimiliano Nastasi (ITA)"},null,"L32 O13","1er gr. 7","2ème gr. 9"]
[14,{"$f":"'Individual Groups'!Q155","v":"Valéry Dejardin (BEL)"},{"$f":"'Individual Groups'!Q172","v":"Massimo Bolognino (ITA)"},2,"-",3,"sd",null,null,null,"Fayçal Rouis (FRA)",{"$f":"'Individual Groups'!Q138","v":"Christian Haas (AUT)"},null,"L32 O14","2ème gr. 8","1er gr. 10"]
[15,{"$f":"'Individual Groups'!Q217","v":"Derek Conti (MLT)"},{"$f":"'Individual Groups'!Q92","v":"Rémi Soret (FRA)"},4,"-",1,null,null,null,null,"Christian Haas (AUT)",{"$f":"'Individual Groups'!Q147","v":"Fayçal Rouis (FRA)"},null,"L32 O15","1er gr. 15","2ème gr. 1"]
[16,{"$f":"'Individual Groups'!Q227","v":"Wolfgang Haas (AUT)"},{"$f":"'Individual Groups'!Q100","v":"Saverio Bari (ITA)"},3,"-",2,null,null,null,null,"Romain Lafontaine (FRA)",{"$f":"'Individual Groups'!Q156","v":"Romain Lafontaine (FRA)"},null,"L32 O16","2ème gr. 16","1er gr. 2"]
[]
[null,"Last 32 Veteran"]
[]
[17,{"$f":"'Individual Groups'!Q238","v":"Francesco Mattiangeli (ITA)"},{"$f":"'Individual Groups'!Q365","v":"Guy Palmer (GIB)"},1,"-",0,null,null,null,null,"Stéphane Pommier (FRA)",{"$f":"'Individual Groups'!Q312","v":"Massimiliano Croatti (ITA)"},null,"L32 V1"]
[18,{"$f":"'Individual Groups'!Q248","v":"Panagiotis Haratsis (GRE)"},{"$f":"'Individual Groups'!Q373","v":"Massimo Cremona (MLT)"},1,"-",4,null,null,null,null,"Massimiliano Croatti (ITA)",{"$f":"'Individual Groups'!Q321","v":"Stéphane Pommier (FRA)"},null,"L32 V2"]
[19,{"$f":"'Individual Groups'!Q310","v":"John Field (GIB)"},{"$f":"'Individual Groups'!Q293","v":"Benoît Massart (BEL)"},2,"-",1,null,null,null,null,"Giorgos Aggelinas (GRE)",{"$f":"'Individual Groups'!Q330","v":"Andy Beskaby (SCO)"},null,"L32 V3"]
[20,{"$f":"'Individual Groups'!Q320","v":"Dimitris Stamatopoulos (GRE)"},{"$f":"'Individual Groups'!Q301","v":"Chris Aggelinas (GRE)"},4,"-",0,null,null,null,null,"Andy Beskaby (SCO)",{"$f":"'Individual Groups'!Q339","v":"Giorgos Aggelinas (GRE)"},null,"L32 V4"]
[21,{"$f":"'Individual Groups'!Q274","v":"Günther Bamberzky (AUT)"},{"$f":"'Individual Groups'!Q329","v":"Rainer Vogt (GER)"},2,"-",1,null,null,null,null,"Jose Luis Bonavia (GIB)",{"$f":"'Individual Groups'!Q348","v":"Jose Luis Bonavia (GIB)"},null,"L32 V5"]
[22,{"$f":"'Individual Groups'!Q284","v":"Arturo Martínez (ESP)"},{"$f":"'Individual Groups'!Q337","v":"Eric Threis (BEL)"},0,"-",2,null,null,null,null,"Manfred Pawlica (AUT)",{"$f":"'Individual Groups'!Q357","v":"Manfred Pawlica (AUT)"},null,"L32 V6"]
[23,{"$f":"'Individual Groups'!Q346","v":"Alain Jadot (BEL)"},{"$f":"'Individual Groups'!Q257","v":"Frank Stiller (GER)"},3,"-",0,null,null,null,null,"Justin Finch (ENG)",{"$f":"'Individual Groups'!Q366","v":"Justin Finch (ENG)"},null,"L32 V7"]
[24,{"$f":"'Individual Groups'!Q356","v":"Arnold Mair (GER)"},{"$f":"'Individual Groups'!Q265","v":"Daniel Scheen (BEL)"},3,"-",2,"sd",null,null,null,"Juan Carlos Granados (ESP)",{"$f":"'Individual Groups'!Q375","v":"Juan Carlos Granados (ESP)"},null,"L32 V8"]
[25,{"$f":"'Individual Groups'!Q256","v":"Vicenç Prats Salat (ESP)"},{"$f":"'Individual Groups'!Q347","v":"Ferrán Coll (ESP)"},6,"-",3,null,null,null,null,"Patrick Dean (GIB)",{"$f":"'Individual Groups'!Q240","v":"Patrick Dean (GIB)"},null,"L32 V9"]
[26,{"$f":"'Individual Groups'!Q266","v":"Karl-Heinz Haider (AUT)"},{"$f":"'Individual Groups'!Q355","v":"Stefano De Francesco (ITA)"},0,"-",2,null,null,null,null,"Andreas Jung (GER)",{"$f":"'Individual Groups'!Q249","v":"Andreas Jung (GER)"},null,"L32 V10"]
[27,{"$f":"'Individual Groups'!Q328","v":"Charles Aquilina (MLT)"},{"$f":"'Individual Groups'!Q275","v":"Phil Redman (ENG)"},0,"-",1,"sd",null,null,null,"Paul Eyes (USA)",{"$f":"'Individual Groups'!Q258","v":"Paul Eyes (USA)"},null,"L32 V11"]
[28,{"$f":"'Individual Groups'!Q338","v":"John Zammit (MLT)"},{"$f":"'Individual Groups'!Q283","v":"Gianfranco Calonico (ITA)"},0,"-",4,null,null,null,null,"Jeremy Bradley (ENG)",{"$f":"'Individual Groups'!Q267","v":"Jeremy Bradley (ENG)"},null,"L32 V12"]
[29,{"$f":"'Individual Groups'!Q292","v":"Erich Hinkelmann (AUT)"},{"$f":"'Individual Groups'!Q311","v":"Patrick de Jong (NED)"},1,"-",3,null,null,null,null,"Xavier Dubois (FRA)",{"$f":"'Individual Groups'!Q276","v":"Xavier Dubois (FRA)"},null,"L32 V13"]
[30,{"$f":"'Individual Groups'!Q302","v":"Éric Naszalyi (FRA)"},{"$f":"'Individual Groups'!Q319","v":"Jason Pisani (MLT)"},1,"-",1,null,3,1,null,"Luis Domingo L. Gutiérrez (ESP)",{"$f":"'Individual Groups'!Q285","v":"Axel Modeste (FRA)"},null,"L32 V14"]
[31,{"$f":"'Individual Groups'!Q364","v":"Patrizio Lazzaretti (ITA)"},{"$f":"'Individual Groups'!Q239","v":"Antonio Montaño (ESP)"},4,"-",1,null,null,null,null,"Axel Modeste (FRA)",{"$f":"'Individual Groups'!Q294","v":"Luis Domingo L. Gutiérrez (ESP)"},null,"L32 V15"]
[32,{"$f":"'Individual Groups'!Q374","v":"David Busch (AUT)"},{"$f":"'Individual Groups'!Q247","v":"Pascal Scheen (BEL)"},3,"-",2,"sd",null,null,null,"Rob Conway (SCO)",{"$f":"'Individual Groups'!Q303","v":"Rob Conway (SCO)"},null,"L32 V16"]
[]
[33,{"$f":"'Individual Groups'!E56","v":"Ricardo Jose (POR)"},{"$f":"'Individual Groups'!B56","v":"Antonio Casin (ESP)"},5,"-",7,null,null,null,null,"Andrew Abela (MLT)",{"$f":"'Individual Groups'!Q94","v":"Andrew Abela (MLT)"}]
[34,{"$f":"'Individual Groups'!C56","v":"Quentin Van Glabeke (BEL)"},{"$f":"'Individual Groups'!D56","v":"Théo Modeste (FRA)"},2,"-",3,null,null,null,null,"Brett Price (ENG)",{"$f":"'Individual Groups'!Q103","v":"Brett Price (ENG)"}]
[35,{"$f":"'Individual Groups'!E57","v":"Paolo Zambello (ITA)"},{"$f":"'Individual Groups'!B57","v":"Raphaël Pommier (FRA)"},6,"-",3,null,null,null,null,"Terry Arnold (ENG)",{"$f":"'Individual Groups'!Q112","v":"Terry Arnold (ENG)"}]
[36,{"$f":"'Individual Groups'!C57","v":"Corentin Wauthy (BEL)"},{"$f":"'Individual Groups'!D57","v":"Afonso Pereira (POR)"},2,"-",6,null,null,null,null,"José David Somoza (ESP)",{"$f":"'Individual Groups'!Q121","v":"José David Somoza (ESP)"}]
[37,{"$f":"'Individual Groups'!E58","v":"Arnaud Le Téno (FRA)"},{"$f":"'Individual Groups'!B58","v":"Elliott Bellefontaine (ENG)"},4,"-",2,null,null,null,null,"Marcel Kwiatkowski (GER)",{"$f":"'Individual Groups'!Q130","v":"Marcel Kwiatkowski (GER)"}]
[38,{"$f":"'Individual Groups'!C58","v":"William Van den Houte (BEL)"},{"$f":"'Individual Groups'!D58","v":"Claudio Panebianco (ITA)"},1,"-",5,null,null,null,null,"Jean-Marie Amberny (FRA)",{"$f":"'Individual Groups'!Q139","v":"Jean-Marie Amberny (FRA)"}]
[39,{"$f":"'Individual Groups'!E59","v":"Paul Naszalyi (FRA)"},{"$f":"'Individual Groups'!B59","v":"Matteo Ciccarelli (ITA)"},1,"-",8,null,null,null,null,"Frank Hagenkötter (GER)",{"$f":"'Individual Groups'!Q148","v":"Thomas Wittmann (AUT)"}]
[40,{"$f":"'Individual Groups'!C59","v":"Kai Hagenkötter (GER)"},{"$f":"'Individual Groups'!D59","v":"Maxime Muraille (BEL)"},3,"-",2,null,null,null,null,"Thomas Wittmann (AUT)",{"$f":"'Individual Groups'!Q157","v":"Frank Hagenkötter (GER)"}]
[41,{"$f":"'Individual Groups'!E67","v":"Corentin Boltz (BEL)"},{"$f":"'Individual Groups'!B67","v":"Leonardo Giudice (ITA)"},0,"-",5,null,null,null,null,"Julio Candélas (ESP)",{"$f":"'Individual Groups'!Q166","v":"Julio Candélas (ESP)"}]
[42,{"$f":"'Individual Groups'!C67","v":"Niall Dean (GIB)"},{"$f":"'Individual Groups'!D67","v":"Thomas Price (ENG)"},3,"-",0,null,null,null,null,"Juan Carlos Pinto (ESP)",{"$f":"'Individual Groups'!Q175","v":"Juan Carlos Pinto (ESP)"}]
[43,{"$f":"'Individual Groups'!E68","v":"Jonathan Nichtenberger (AUT)"},{"$f":"'Individual Groups'!B68","v":"Alwin Krause (GER)"},3,"-",3,null,null,null,null,"Jonathan Dotto (GIB)",{"$f":"'Individual Groups'!Q184","v":"Jonathan Dotto (GIB)"}]
[44,{"$f":"'Individual Groups'!C68","v":"Antonio García Fernández (ESP)"},{"$f":"'Individual Groups'!D68","v":"Eliott Legall (FRA)"},3,"-",0,null,null,null,null,"Suguru Fujino (JPN)",{"$f":"'Individual Groups'!Q193","v":"Suguru Fujino (JPN)"}]
[45,{"$f":"'Individual Groups'!E69","v":"Paul Offmann (FRA)"},{"$f":"'Individual Groups'!B69","v":"Kye Arnold (ENG)"},0,"-",3,null,null,null,null,"Lawrence Alvarez (GIB)",{"$f":"'Individual Groups'!Q202","v":"Lawrence Alvarez (GIB)"}]
[46,{"$f":"'Individual Groups'!C69","v":"Moritz Jung (GER)"},{"$f":"'Individual Groups'!D69","v":"Antonio La Torre (ITA)"},3,"-",2,null,null,null,null,"Nuno Henriques (POR)",{"$f":"'Individual Groups'!Q211","v":"Nuno Henriques (POR)"}]
[47,{"$f":"'Individual Groups'!E70","v":"Mathéo Grégoire (BEL)"},{"$f":"'Individual Groups'!B70","v":"Lukas Eppensteiner (AUT)"},1,"-",3,null,null,null,null,"Gregg Deinhart (USA)",{"$f":"'Individual Groups'!Q220","v":"Anton V. Aleksadrovich (RUS)"}]
[48,{"$f":"'Individual Groups'!C70","v":"Matteo Brillantino (ITA)"},{"$f":"'Individual Groups'!D70","v":"Rhys Williams (ENG)"},6,"-",2,null,null,null,null,"Vito Di Ruggiero (BEL)",{"$f":"'Individual Groups'!Q229","v":"Dmitry L. Valeriavitch (RUS)"}]
[49,{"$f":"'Individual Groups'!E78","v":"Jesús Maireles (ESP)"},{"$f":"'Individual Groups'!B78","v":"Francesco Tozzi (ITA)"},0,"-",3,null,null,null,null,"Dario Passadore (USA)",{"$f":"'Individual Groups'!Q241","v":"Dario Passadore (USA)"},{"$f":"'Individual Groups'!Q376","v":"Vito Di Ruggiero (BEL)"}]
[50,{"$f":"'Individual Groups'!C78","v":"Gabriel Lombardi (AUS)"},{"$f":"'Individual Groups'!D78","v":"Noah Denne (BEL)"},0,"-",3,"ff",null,null,null,"Mat Atkin (ENG)",{"$f":"'Individual Groups'!Q250","v":"Mat Atkin (ENG)"},{"$f":"'Individual Groups'!Q367","v":"Gregg Deinhart (USA)"}]
[51,{"$f":"'Individual Groups'!E79","v":"Alex Genart (BEL)"},{"$f":"'Individual Groups'!B79","v":"Giorgio Giudice (ITA)"},0,"-",4,null,null,null,null,"Mike Tillman (USA)",{"$f":"'Individual Groups'!Q259","v":"Henk Landzaat (NED)"},{"$f":"'Individual Groups'!Q358","v":"Thierry Vivron (FRA)"}]
[52,{"$f":"'Individual Groups'!C79","v":"Joseph Agius (MLT)"},{"$f":"'Individual Groups'!D79","v":"Mark Offmann (FRA)"},1,"-",1,null,null,null,null,"Richard Berllaque (GIB)",{"$f":"'Individual Groups'!Q268","v":"Richard Berllaque (GIB)"},{"$f":"'Individual Groups'!Q349","v":"Robert Green (AUS)"}]
[53,{"$f":"'Individual Groups'!E80","v":"Aurélien Feye (BEL)"},{"$f":"'Individual Groups'!B80","v":"Joshua Foreman (ENG)"},0,"-",1,null,null,null,null,"Paul O’Donovan Rossa (USA)",{"$f":"'Individual Groups'!Q277","v":"Paul O’Donovan Rossa (USA)"},{"$f":"'Individual Groups'!Q340","v":"Tom Horn (GER)"}]
[54,{"$f":"'Individual Groups'!C80","v":"Kristian Silagiev (ESP)"},{"$f":"'Individual Groups'!D80","v":"Cristian Fricano  (ITA)"},1,"-",2,null,null,null,null,"Brian Daley (ENG)",{"$f":"'Individual Groups'!Q286","v":"Andrey K. Nicolaevich (RUS)"},{"$f":"'Individual Groups'!Q331","v":"Brian Daley (ENG)"}]
[55,null,null,null,"-"]
[56,null,null,null,"-"]
[]
[]
["Série 8 - 15h50"]
[]
["Tables"]
[null,null,null,null,null,null,null,null,null,null,null,"Referees"]
[]
[null,"Last 16 Open"]
[]
[1,{"$f":"IF(H410=\"\",IF(D410=\"\",CONCATENATE(\"Winner \", N410),IF(D410>F410,B410,C410)),IF(H410>I410,B410,C410))","v":"Juan Manuel Noguera (ESP)"},{"$f":"IF(H411=\"\",IF(D411=\"\",CONCATENATE(\"Winner \", N411),IF(D411>F411,B411,C411)),IF(H411>I411,B411,C411))","v":"Maikel de Haas (NED)"},5,"-",1,null,null,null,null,"Sérgio Ramos (POR)",{"$f":"IF(H418=\"\",IF(D418=\"\",CONCATENATE(\"Loser\",N418),IF(D418<F418,B418,C418)),IF(H418<I418,B418,C418))","v":"Sérgio Ramos (POR)"},null,"L16 O1"]
[2,{"$f":"IF(H412=\"\",IF(D412=\"\",CONCATENATE(\"Winner \", N412),IF(D412>F412,B412,C412)),IF(H412>I412,B412,C412))","v":"Sébastien Scheen (BEL)"},{"$f":"IF(H413=\"\",IF(D413=\"\",CONCATENATE(\"Winner \", N413),IF(D413>F413,B413,C413)),IF(H413>I413,B413,C413))","v":"Alexander Haas (AUT)"},3,"-",2,"sd",null,null,null,"Lazaros Papakonstantinou (GRE)",{"$f":"IF(H419=\"\",IF(D419=\"\",CONCATENATE(\"Loser\",N419),IF(D419<F419,B419,C419)),IF(H419<I419,B419,C419))","v":"Lazaros Papakonstantinou (GRE)"},null,"L16 O2"]
[3,{"$f":"IF(H414=\"\",IF(D414=\"\",CONCATENATE(\"Winner \", N414),IF(D414>F414,B414,C414)),IF(H414>I414,B414,C414))","v":"Wolfgang Leitner (AUT)"},{"$f":"IF(H415=\"\",IF(D415=\"\",CONCATENATE(\"Winner \", N415),IF(D415>F415,B415,C415)),IF(H415>I415,B415,C415))","v":"Luca Zambello (ITA)"},4,"-",1,null,null,null,null,"Giorgos Koutis (GRE)",{"$f":"IF(H420=\"\",IF(D420=\"\",CONCATENATE(\"Loser\",N420),IF(D420<F420,B420,C420)),IF(H420<I420,B420,C420))","v":"Giorgos Koutis (GRE)"},null,"L16 O3"]
[4,{"$f":"IF(H416=\"\",IF(D416=\"\",CONCATENATE(\"Winner \", N416),IF(D416>F416,B416,C416)),IF(H416>I416,B416,C416))","v":"Rémy Huynh (BEL)"},{"$f":"IF(H417=\"\",IF(D417=\"\",CONCATENATE(\"Winner \", N417),IF(D417>F417,B417,C417)),IF(H417>I417,B417,C417))","v":"Daniele Bertelli (ITA)"},1,"-",2,null,null,null,null,"Angelo Borg (MLT)",{"$f":"IF(H421=\"\",IF(D421=\"\",CONCATENATE(\"Loser\",N421),IF(D421<F421,B421,C421)),IF(H421<I421,B421,C421))","v":"Angelo Borg (MLT)"},null,"L16 O4"]
[5,{"$f":"IF(H418=\"\",IF(D418=\"\",CONCATENATE(\"Winner \", N418),IF(D418>F418,B418,C418)),IF(H418>I418,B418,C418))","v":"Luca Colangelo (ITA)"},{"$f":"IF(H419=\"\",IF(D419=\"\",CONCATENATE(\"Winner \", N419),IF(D419>F419,B419,C419)),IF(H419>I419,B419,C419))","v":"Axel Donval (FRA)"},4,"-",2,null,null,null,null,"Spyros Patrinos (GRE)",{"$f":"IF(H410=\"\",IF(D410=\"\",CONCATENATE(\"Loser\",N410),IF(D410<F410,B410,C410)),IF(H410<I410,B410,C410))","v":"Spyros Patrinos (GRE)"},null,"L16 O5"]
[6,{"$f":"IF(H420=\"\",IF(D420=\"\",CONCATENATE(\"Winner \", N420),IF(D420>F420,B420,C420)),IF(H420>I420,B420,C420))","v":"Christophe Dheur (BEL)"},{"$f":"IF(H421=\"\",IF(D421=\"\",CONCATENATE(\"Winner \", N421),IF(D421>F421,B421,C421)),IF(H421>I421,B421,C421))","v":"Sami Targui (BEL)"},3,"-",1,null,null,null,null,"Jean-Guillaume Einsle (FRA)",{"$f":"IF(H411=\"\",IF(D411=\"\",CONCATENATE(\"Loser\",N411),IF(D411<F411,B411,C411)),IF(H411<I411,B411,C411))","v":"Jean-Guillaume Einsle (FRA)"},null,"L16 O6"]
[7,{"$f":"IF(H422=\"\",IF(D422=\"\",CONCATENATE(\"Winner \", N422),IF(D422>F422,B422,C422)),IF(H422>I422,B422,C422))","v":"Spyros Hatzaras (GRE)"},{"$f":"IF(H423=\"\",IF(D423=\"\",CONCATENATE(\"Winner \", N423),IF(D423>F423,B423,C423)),IF(H423>I423,B423,C423))","v":"Massimo Bolognino (ITA)"},1,"-",2,null,null,null,null,"Alexander Ruf (GER)","Alexander Ruf (GER)",null,"L16 O7"]
[8,{"$f":"IF(H424=\"\",IF(D424=\"\",CONCATENATE(\"Winner \", N424),IF(D424>F424,B424,C424)),IF(H424>I424,B424,C424))","v":"Derek Conti (MLT)"},{"$f":"IF(H425=\"\",IF(D425=\"\",CONCATENATE(\"Winner \", N425),IF(D425>F425,B425,C425)),IF(H425>I425,B425,C425))","v":"Wolfgang Haas (AUT)"},2,"-",1,null,null,null,null,"Justin Leroy (BEL)","Justin Leroy (BEL)",null,"L16 O8"]
[]
[null,"Last 16 Veteran"]
[]
[9,{"$f":"IF(H429=\"\",IF(D429=\"\",CONCATENATE(\"Winner \", N429),IF(D429>F429,B429,C429)),IF(H429>I429,B429,C429))","v":"Francesco Mattiangeli (ITA)"},{"$f":"IF(H430=\"\",IF(D430=\"\",CONCATENATE(\"Winner \", N430),IF(D430>F430,B430,C430)),IF(H430>I430,B430,C430))","v":"Massimo Cremona (MLT)"},0,"-",1,"sd",null,null,null,"Kostas Stamokostas (GRE)",{"$f":"IF(H414=\"\",IF(D414=\"\",CONCATENATE(\"Loser\",N414),IF(D414<F414,B414,C414)),IF(H414<I414,B414,C414))","v":"Kostas Stamokostas (GRE)"},null,"L16 V1"]
[10,{"$f":"IF(H431=\"\",IF(D431=\"\",CONCATENATE(\"Winner \", N431),IF(D431>F431,B431,C431)),IF(H431>I431,B431,C431))","v":"John Field (GIB)"},{"$f":"IF(H432=\"\",IF(D432=\"\",CONCATENATE(\"Winner \", N432),IF(D432>F432,B432,C432)),IF(H432>I432,B432,C432))","v":"Dimitris Stamatopoulos (GRE)"},2,"-",1,null,null,null,null,"Bessim Golger (BEL)",{"$f":"IF(H415=\"\",IF(D415=\"\",CONCATENATE(\"Loser\",N415),IF(D415<F415,B415,C415)),IF(H415<I415,B415,C415))","v":"Bessim Golger (BEL)"},null,"L16 V2"]
[11,{"$f":"IF(H433=\"\",IF(D433=\"\",CONCATENATE(\"Winner \", N433),IF(D433>F433,B433,C433)),IF(H433>I433,B433,C433))","v":"Günther Bamberzky (AUT)"},{"$f":"IF(H434=\"\",IF(D434=\"\",CONCATENATE(\"Winner \", N434),IF(D434>F434,B434,C434)),IF(H434>I434,B434,C434))","v":"Eric Threis (BEL)"},1,"-",1,null,2,1,null,"Malcolm Lees (SCO)","Malcolm Lees (SCO)",null,"L16 V3"]
[12,{"$f":"IF(H435=\"\",IF(D435=\"\",CONCATENATE(\"Winner \", N435),IF(D435>F435,B435,C435)),IF(H435>I435,B435,C435))","v":"Alain Jadot (BEL)"},{"$f":"IF(H436=\"\",IF(D436=\"\",CONCATENATE(\"Winner \", N436),IF(D436>F436,B436,C436)),IF(H436>I436,B436,C436))","v":"Arnold Mair (GER)"},3,"-",1,null,null,null,null,"Kostas Seses (GRE)","Kostas Seses (GRE)",null,"L16 V4"]
[13,{"$f":"IF(H437=\"\",IF(D437=\"\",CONCATENATE(\"Winner \", N437),IF(D437>F437,B437,C437)),IF(H437>I437,B437,C437))","v":"Vicenç Prats Salat (ESP)"},{"$f":"IF(H438=\"\",IF(D438=\"\",CONCATENATE(\"Winner \", N438),IF(D438>F438,B438,C438)),IF(H438>I438,B438,C438))","v":"Stefano De Francesco (ITA)"},3,"-",2,null,null,null,null,"Heinz Eder (AUT)",{"$f":"IF(H422=\"\",IF(D422=\"\",CONCATENATE(\"Loser\",N422),IF(D422<F422,B422,C422)),IF(H422<I422,B422,C422))","v":"Heinz Eder (AUT)"},null,"L16 V5"]
[14,{"$f":"IF(H439=\"\",IF(D439=\"\",CONCATENATE(\"Winner \", N439),IF(D439>F439,B439,C439)),IF(H439>I439,B439,C439))","v":"Phil Redman (ENG)"},{"$f":"IF(H440=\"\",IF(D440=\"\",CONCATENATE(\"Winner \", N440),IF(D440>F440,B440,C440)),IF(H440>I440,B440,C440))","v":"Gianfranco Calonico (ITA)"},0,"-",3,null,null,null,null,"Valéry Dejardin (BEL)",{"$f":"IF(H423=\"\",IF(D423=\"\",CONCATENATE(\"Loser\",N423),IF(D423<F423,B423,C423)),IF(H423<I423,B423,C423))","v":"Valéry Dejardin (BEL)"},null,"L16 V6"]
[15,{"$f":"IF(H441=\"\",IF(D441=\"\",CONCATENATE(\"Winner \", N441),IF(D441>F441,B441,C441)),IF(H441>I441,B441,C441))","v":"Patrick de Jong (NED)"},{"$f":"IF(H442=\"\",IF(D442=\"\",CONCATENATE(\"Winner \", N442),IF(D442>F442,B442,C442)),IF(H442>I442,B442,C442))","v":"Éric Naszalyi (FRA)"},2,"-",3,"sd",null,null,null,"Saverio Bari (ITA)","Rémi Soret (FRA)",null,"L16 V7"]
[16,{"$f":"IF(H443=\"\",IF(D443=\"\",CONCATENATE(\"Winner \", N443),IF(D443>F443,B443,C443)),IF(H443>I443,B443,C443))","v":"Patrizio Lazzaretti (ITA)"},{"$f":"IF(H444=\"\",IF(D444=\"\",CONCATENATE(\"Winner \", N444),IF(D444>F444,B444,C444)),IF(H444>I444,B444,C444))","v":"David Busch (AUT)"},1,"-",2,null,null,null,null,"Rémi Soret (FRA)","Saverio Bari (ITA)",null,"L16 V8"]
[]
[null,"Barrage Ladies"]
[]
[17,{"$f":"'Individual Groups'!Q403","v":"Audrey Herbaut (FRA)"},{"$f":"'Individual Groups'!Q422","v":"Helène Boniface (ITA)"},3,"-",1,null,null,null,null,"Benoît Massart (BEL)",{"$f":"IF(H429=\"\",IF(D429=\"\",CONCATENATE(\"Loser \",N429),IF(D429<F429,B429,C429)),IF(H429<I429,B429,C429))","v":"Guy Palmer (GIB)"},null,"L16 L1","1er gr. 3","2ème gr. 5"]
[18,{"$f":"'Individual Groups'!Q412","v":"Victoria Büsing (GER)"},{"$f":"'Individual Groups'!Q440","v":"Margault Delval (BEL)"},1,"-",0,"sd",null,null,null,"Guy Palmer (GIB)",{"$f":"IF(H430=\"\",IF(D430=\"\",CONCATENATE(\"Loser \",N430),IF(D430<F430,B430,C430)),IF(H430<I430,B430,C430))","v":"Panagiotis Haratsis (GRE)"},null,"L16 L2","1er gr. 4","2ème gr. 7"]
[19,{"$f":"'Individual Groups'!Q421","v":"Delphine Dieudonne (BEL)"},{"$f":"'Individual Groups'!Q431","v":"Françoise Guyot (FRA)"},5,"-",0,null,null,null,null,"Panagiotis Haratsis (GRE)","Benoît Massart (BEL)",null,"L16 L3","1er gr. 5","2ème gr. 6"]
[20,{"$f":"'Individual Groups'!Q430","v":"Giulia Brillantino (ITA)"},{"$f":"'Individual Groups'!Q413","v":"Carolina Villarigues (POR)"},1,"-",2,null,null,null,null,"Chris Aggelinas (GRE)","Chris Aggelinas (GRE)",null,"L16 L4","1er gr. 6","2ème gr. 4"]
[21,{"$f":"'Individual Groups'!Q439","v":"Giuditta Lo Cascio (ITA)"},{"$f":"'Individual Groups'!Q386","v":"Elodie Bertholet (BEL)"},2,"-",1,null,null,null,null,"Rainer Vogt (GER)","Rainer Vogt (GER)",null,"L16 L5","1er gr. 7","2ème gr. 1"]
[22,{"$f":"'Individual Groups'!Q395","v":"Emilie Despretz (BEL)"},{"$f":"'Individual Groups'!Q404","v":"Alyssa Guyaux (BEL)"},6,"-",1,null,null,null,null,"Arturo Martínez (ESP)","Arturo Martínez (ESP)",null,"L16 L6","2ème gr. 2","2ème gr. 3"]
[]
[null,"Last 16 U19"]
[]
[23,{"$f":"'Individual Groups'!Q451","v":"Florian Giaux (BEL)"},{"$f":"'Individual Groups'!Q506","v":"William Van den Houte (BEL)"},2,"-",2,null,0,1,null,"Ferrán Coll (ESP)",{"$f":"IF(H435=\"\",IF(D435=\"\",CONCATENATE(\"Loser \",N435),IF(D435<F435,B435,C435)),IF(H435<I435,B435,C435))","v":"Frank Stiller (GER)"},null,"L16 J1","1er gr. 1","2ème gr. 7"]
[24,{"$f":"'Individual Groups'!Q461","v":"David González (ESP)"},{"$f":"'Individual Groups'!Q514","v":"Matteo Ciccarelli (ITA)"},1,"-",3,null,null,null,null,"Daniel Scheen (BEL)",{"$f":"IF(H436=\"\",IF(D436=\"\",CONCATENATE(\"Loser \",N436),IF(D436<F436,B436,C436)),IF(H436<I436,B436,C436))","v":"Daniel Scheen (BEL)"},null,"L16 J2","2ème gr. 2","1er gr. 8"]
[25,{"$f":"'Individual Groups'!Q487","v":"Antonio Casin (ESP)"},{"$f":"'Individual Groups'!Q470","v":"Martin Antoine (BEL)"},4,"-",2,null,null,null,null,"Frank Stiller (GER)",{"$f":"IF(H437=\"\",IF(D437=\"\",CONCATENATE(\"Loser \",N437),IF(D437<F437,B437,C437)),IF(H437<I437,B437,C437))","v":"Ferrán Coll (ESP)"},null,"L16 J3","1er gr. 5","2ème gr. 3"]
[26,{"$f":"'Individual Groups'!Q497","v":"Afonso Pereira (POR)"},{"$f":"'Individual Groups'!Q478","v":"Andrea Ciccarelli (ITA)"},0,"-",2,null,null,null,null,"Karl-Heinz Haider (AUT)","Karl-Heinz Haider (AUT)",null,"L16 J4","2ème gr. 6","1er gr. 4"]
[27,{"$f":"'Individual Groups'!Q469","v":"Nicola Borgo (ITA)"},{"$f":"'Individual Groups'!Q488","v":"Théo Modeste (FRA)"},8,"-",1,null,null,null,null,"Charles Aquilina (MLT)","Charles Aquilina (MLT)",null,"L16 J5","1er gr. 3","2ème gr. 5"]
[28,{"$f":"'Individual Groups'!Q479","v":"Steffen Despretz (BEL)"},{"$f":"'Individual Groups'!Q496","v":"Paolo Zambello (ITA)"},1,"-",2,"sd",null,null,null,"John Zammit (MLT)","John Zammit (MLT)",null,"L16 J6","2ème gr. 4","1er gr. 6"]
[29,{"$f":"'Individual Groups'!Q505","v":"Claudio Panebianco (ITA)"},{"$f":"'Individual Groups'!Q452","v":"Nikos Haratsis (GRE)"},4,"-",1,null,null,null,null,"Erich Hinkelmann (AUT)","Erich Hinkelmann (AUT)",null,"L16 J7","1er gr. 7","2ème gr. 1"]
[30,{"$f":"'Individual Groups'!Q515","v":"Kai Hagenkötter (GER)"},{"$f":"'Individual Groups'!Q460","v":"Marco Di Vito (ITA)"},3,"-",3,null,4,3,null,"Jason Pisani (MLT)","Jason Pisani (MLT)",null,"L16 J8","2ème gr. 8","1er gr. 2"]
[]
[null,"Last 16 U15"]
[]
[31,{"$f":"'Individual Groups'!Q526","v":"Maxime Rairoux (BEL)"},{"$f":"'Individual Groups'!Q581","v":"Antonio La Torre (ITA)"},2,"-",1,null,null,null,null,"Antonio Montaño (ESP)",{"$f":"IF(H443=\"\",IF(D443=\"\",CONCATENATE(\"Loser \",N443),IF(D443<F443,B443,C443)),IF(H443<I443,B443,C443))","v":"Antonio Montaño (ESP)"},null,"L16 C1"]
[32,{"$f":"'Individual Groups'!Q536","v":"Marios Strommer (AUT)"},{"$f":"'Individual Groups'!Q589","v":"Matteo Brillantino (ITA)"},2,"-",1,null,null,null,null,"Pascal Scheen (BEL)",{"$f":"IF(H444=\"\",IF(D444=\"\",CONCATENATE(\"Loser \",N444),IF(D444<F444,B444,C444)),IF(H444<I444,B444,C444))","v":"Pascal Scheen (BEL)"},null,"L16 C2"]
[33,{"$f":"'Individual Groups'!Q562","v":"Leonardo Giudice (ITA)"},{"$f":"'Individual Groups'!Q545","v":"Corentin Bouchez (BEL)"},4,"-",1,null,null,null,null,"Christopher Bowen (ENG)",{"$f":"'Individual Groups'!Q453","v":"Jody Henrioul (BEL)"},null,"L16 C3"]
[34,{"$f":"'Individual Groups'!Q572","v":"Antonio García Fernández (ESP)"},{"$f":"'Individual Groups'!Q553","v":"Jurgen Balzan (MLT)"},1,"-",2,"sd",null,null,null,"Nathan Dizier (BEL)",{"$f":"'Individual Groups'!Q462","v":"Nathan Dizier (BEL)"},null,"L16 C4"]
[35,{"$f":"'Individual Groups'!Q544","v":"Claudio La Torre (ITA)"},{"$f":"'Individual Groups'!Q563","v":"Niall Dean (GIB)"},5,"-",0,null,null,null,null,"Jody Henrioul (BEL)",{"$f":"'Individual Groups'!Q471","v":"Christopher Bowen (ENG)"},null,"L16 C5"]
[36,{"$f":"'Individual Groups'!Q554","v":"Louison Giaux (BEL)"},{"$f":"'Individual Groups'!Q571","v":"Alwin Krause (GER)"},0,"-",4,null,null,null,null,"Paul Naszalyi (FRA)",{"$f":"'Individual Groups'!Q480","v":"Fabio Bianco (GER)"},null,"L16 C6"]
[37,{"$f":"'Individual Groups'!Q580","v":"Moritz Jung (GER)"},{"$f":"'Individual Groups'!Q527","v":"Riccardo Lazzari (ITA)"},4,"-",1,null,null,null,null,"Quentin Van Glabeke (BEL)",{"$f":"'Individual Groups'!Q489","v":"Quentin Van Glabeke (BEL)"},null,"L16 C7"]
[38,{"$f":"'Individual Groups'!Q590","v":"Lukas Eppensteiner (AUT)"},{"$f":"'Individual Groups'!Q535","v":"Andrea Bolognino (ITA)"},0,"-",2,null,null,null,null,"Fabio Bianco (GER)",{"$f":"'Individual Groups'!Q498","v":"Raphaël Pommier (FRA)"},null,"L16 C8"]
[]
[null,"Barrage U12"]
[]
[39,{"$f":"'Individual Groups'!Q619","v":"Basile Magermans (BEL)"},{"$f":"'Individual Groups'!Q638","v":"Jesús Maireles (ESP)"},9,"-",1,null,null,null,null,"Nealmark Bonnici (MLT)",{"$f":"'Individual Groups'!Q507","v":"Arnaud Le Téno (FRA)"},null,"L16 M1"]
[40,{"$f":"'Individual Groups'!Q628","v":"Riccardo Natoli (ITA)"},{"$f":"'Individual Groups'!Q656","v":"Kristian Silagiev (ESP)"},1,"-",1,null,0,1,null,"Maxime Muraille (BEL)",{"$f":"'Individual Groups'!Q516","v":"Maxime Muraille (BEL)"},null,"L16 M2"]
[41,{"$f":"'Individual Groups'!Q637","v":"Francesco Tozzi (ITA)"},{"$f":"'Individual Groups'!Q647","v":"Mark Offmann (FRA)"},5,"-",1,null,null,null,null,"Connor Bowden (ENG)",{"$f":"'Individual Groups'!Q454","v":"Connor Bowden (ENG)"},{"$f":"'Individual Groups'!Q490","v":"Ricardo Jose (POR)"},"L16 M3"]
[42,{"$f":"'Individual Groups'!Q646","v":"Giorgio Giudice (ITA)"},{"$f":"'Individual Groups'!Q629","v":"Quentin Ausset (FRA)"},4,"-",0,null,null,null,null,"Koshiro Shibata (JPN)",{"$f":"'Individual Groups'!Q463","v":"Koshiro Shibata (JPN)"},{"$f":"'Individual Groups'!Q499","v":"Corentin Wauthy (BEL)"},"L16 M4"]
[43,{"$f":"'Individual Groups'!Q655","v":"Cristian Fricano  (ITA)"},{"$f":"'Individual Groups'!Q602","v":"Jérôme Cyganek (BEL)"},6,"-",0,null,null,null,null,"Ricardo Jose (POR)",{"$f":"'Individual Groups'!Q472","v":"Jesús Moreno (ESP)"},{"$f":"'Individual Groups'!Q508","v":"Elliott Bellefontaine (ENG)"},"L16 M5"]
[44,{"$f":"'Individual Groups'!Q611","v":"Lucas Pere (BEL)"},{"$f":"'Individual Groups'!Q620","v":"Diogo Pereira (POR)"},3,"-",2,null,null,null,null,"Arnaud Le Téno (FRA)",{"$f":"'Individual Groups'!Q481","v":"Nealmark Bonnici (MLT)"},{"$f":"'Individual Groups'!Q517","v":"Paul Naszalyi (FRA)"},"L16 M6"]
[]
[]
[]
[]
["Série 9 - 16h55"]
[]
["Tables"]
[null,null,null,null,null,null,null,null,null,null,null,"Referees"]
[]
[null,"1/4 final open"]
[]
[1,{"$f":"IF(H479=\"\",IF(D479=\"\",CONCATENATE(\"Winner \", N479),IF(D479>F479,B479,C479)),IF(H479>I479,B479,C479))","v":"Juan Manuel Noguera (ESP)"},{"$f":"IF(H480=\"\",IF(D480=\"\",CONCATENATE(\"Winner \", N480),IF(D480>F480,B480,C480)),IF(H480>I480,B480,C480))","v":"Sébastien Scheen (BEL)"},4,"-",1,null,null,null,null,"Luca Zambello (ITA)",{"$f":"IF(H479=\"\",IF(D479=\"\",CONCATENATE(\"Loser\",N479),IF(D479<F479,B479,C479)),IF(H479<I479,B479,C479))","v":"Maikel de Haas (NED)"},null,"1/4 O1"]
[2,{"$f":"IF(H481=\"\",IF(D481=\"\",CONCATENATE(\"Winner \", N481),IF(D481>F481,B481,C481)),IF(H481>I481,B481,C481))","v":"Wolfgang Leitner (AUT)"},{"$f":"IF(H482=\"\",IF(D482=\"\",CONCATENATE(\"Winner \", N482),IF(D482>F482,B482,C482)),IF(H482>I482,B482,C482))","v":"Daniele Bertelli (ITA)"},4,"-",3,"sd",null,null,null,"Maikel de Haas (NED)",{"$f":"IF(H480=\"\",IF(D480=\"\",CONCATENATE(\"Loser\",N480),IF(D480<F480,B480,C480)),IF(H480<I480,B480,C480))","v":"Alexander Haas (AUT)"},null,"1/4 O2"]
[3,{"$f":"IF(H483=\"\",IF(D483=\"\",CONCATENATE(\"Winner \", N483),IF(D483>F483,B483,C483)),IF(H483>I483,B483,C483))","v":"Luca Colangelo (ITA)"},{"$f":"IF(H484=\"\",IF(D484=\"\",CONCATENATE(\"Winner \", N484),IF(D484>F484,B484,C484)),IF(H484>I484,B484,C484))","v":"Christophe Dheur (BEL)"},5,"-",1,null,null,null,null,"Alexander Haas (AUT)","Luca Zambello (ITA)",null,"1/4 O3"]
[4,{"$f":"IF(H485=\"\",IF(D485=\"\",CONCATENATE(\"Winner \", N485),IF(D485>F485,B485,C485)),IF(H485>I485,B485,C485))","v":"Massimo Bolognino (ITA)"},{"$f":"IF(H486=\"\",IF(D486=\"\",CONCATENATE(\"Winner \", N486),IF(D486>F486,B486,C486)),IF(H486>I486,B486,C486))","v":"Derek Conti (MLT)"},1,"-",2,"sd",null,null,null,"Rémy Huynh (BEL)","Rémy Huynh (BEL)",null,"1/4 O4"]
[]
[null,"1/4 final veteran"]
[]
[5,{"$f":"IF(H490=\"\",IF(D490=\"\",CONCATENATE(\"Winner \", N490),IF(D490>F490,B490,C490)),IF(H490>I490,B490,C490))","v":"Massimo Cremona (MLT)"},{"$f":"IF(H491=\"\",IF(D491=\"\",CONCATENATE(\"Winner \", N491),IF(D491>F491,B491,C491)),IF(H491>I491,B491,C491))","v":"John Field (GIB)"},2,"-",1,null,null,null,null,"Sami Targui (BEL)",null,null,"1/4 V1"]
[6,{"$f":"IF(H492=\"\",IF(D492=\"\",CONCATENATE(\"Winner \", N492),IF(D492>F492,B492,C492)),IF(H492>I492,B492,C492))","v":"Günther Bamberzky (AUT)"},{"$f":"IF(H493=\"\",IF(D493=\"\",CONCATENATE(\"Winner \", N493),IF(D493>F493,B493,C493)),IF(H493>I493,B493,C493))","v":"Alain Jadot (BEL)"},0,"-",0,null,2,3,null,"Wolfgang Haas (AUT)",null,null,"1/4 V2"]
[7,{"$f":"IF(H494=\"\",IF(D494=\"\",CONCATENATE(\"Winner \", N494),IF(D494>F494,B494,C494)),IF(H494>I494,B494,C494))","v":"Vicenç Prats Salat (ESP)"},{"$f":"IF(H495=\"\",IF(D495=\"\",CONCATENATE(\"Winner \", N495),IF(D495>F495,B495,C495)),IF(H495>I495,B495,C495))","v":"Gianfranco Calonico (ITA)"},1,"-",1,null,1,2,null,"Axel Donval (FRA)",null,null,"1/4 V3"]
[8,{"$f":"IF(H496=\"\",IF(D496=\"\",CONCATENATE(\"Winner \", N496),IF(D496>F496,B496,C496)),IF(H496>I496,B496,C496))","v":"Éric Naszalyi (FRA)"},{"$f":"IF(H497=\"\",IF(D497=\"\",CONCATENATE(\"Winner \", N497),IF(D497>F497,B497,C497)),IF(H497>I497,B497,C497))","v":"David Busch (AUT)"},1,"-",2,null,null,null,null,"Spyros Hatzaras (GRE)",null,null,"1/4 V4"]
[]
[null,"1/4 final ladies"]
[]
[9,{"$f":"'Individual Groups'!Q385","v":"Lydie Pinchart (BEL)"},{"$f":"IF(H506=\"\",IF(D506=\"\",CONCATENATE(\"Winner \", N506),IF(D506>F506,B506,C506)),IF(H506>I506,B506,C506))","v":"Emilie Despretz (BEL)"},0,"-",2,null,null,null,null,"Francesco Mattiangeli (ITA)",null,null,"1/4 L1"]
[10,{"$f":"IF(H503=\"\",IF(D503=\"\",CONCATENATE(\"Winner \", N503),IF(D503>F503,B503,C503)),IF(H503>I503,B503,C503))","v":"Delphine Dieudonne (BEL)"},{"$f":"IF(H502=\"\",IF(D502=\"\",CONCATENATE(\"Winner \", N502),IF(D502>F502,B502,C502)),IF(H502>I502,B502,C502))","v":"Victoria Büsing (GER)"},0,"-",1,null,null,null,null,"Marco Di Vito (ITA)",null,null,"1/4 L2"]
[11,{"$f":"IF(H501=\"\",IF(D501=\"\",CONCATENATE(\"Winner \", N501),IF(D501>F501,B501,C501)),IF(H501>I501,B501,C501))","v":"Audrey Herbaut (FRA)"},{"$f":"IF(H504=\"\",IF(D504=\"\",CONCATENATE(\"Winner \", N504),IF(D504>F504,B504,C504)),IF(H504>I504,B504,C504))","v":"Carolina Villarigues (POR)"},0,"-",1,null,null,null,null,"Patrizio Lazzaretti (ITA)",null,null,"1/4 L3"]
[12,{"$f":"IF(H505=\"\",IF(D505=\"\",CONCATENATE(\"Winner \", N505),IF(D505>F505,B505,C505)),IF(H505>I505,B505,C505))","v":"Giuditta Lo Cascio (ITA)"},{"$f":"'Individual Groups'!Q394","v":"Eleonora Buttitta (ITA)"},1,"-",3,null,null,null,null,"Eric Threis (BEL)",null,null,"1/4 L4"]
[]
[null,"1/4 final U19"]
[]
[13,{"$f":"IF(H510=\"\",IF(D510=\"\",CONCATENATE(\"Winner \", N510),IF(D510>F510,B510,C510)),IF(H510>I510,B510,C510))","v":"William Van den Houte (BEL)"},{"$f":"IF(H511=\"\",IF(D511=\"\",CONCATENATE(\"Winner \", N511),IF(D511>F511,B511,C511)),IF(H511>I511,B511,C511))","v":"Matteo Ciccarelli (ITA)"},1,"-",4,null,null,null,null,"Arnold Mair (GER)",null,null,"1/4 J1"]
[14,{"$f":"IF(H512=\"\",IF(D512=\"\",CONCATENATE(\"Winner \", N512),IF(D512>F512,B512,C512)),IF(H512>I512,B512,C512))","v":"Antonio Casin (ESP)"},{"$f":"IF(H513=\"\",IF(D513=\"\",CONCATENATE(\"Winner \", N513),IF(D513>F513,B513,C513)),IF(H513>I513,B513,C513))","v":"Andrea Ciccarelli (ITA)"},2,"-",1,null,null,null,null,"Martin Antoine (BEL)",null,null,"1/4 J2"]
[15,{"$f":"IF(H514=\"\",IF(D514=\"\",CONCATENATE(\"Winner \", N514),IF(D514>F514,B514,C514)),IF(H514>I514,B514,C514))","v":"Nicola Borgo (ITA)"},{"$f":"IF(H515=\"\",IF(D515=\"\",CONCATENATE(\"Winner \", N515),IF(D515>F515,B515,C515)),IF(H515>I515,B515,C515))","v":"Paolo Zambello (ITA)"},3,"-",2,null,null,null,null,"Dimitris Stamatopoulos (GRE)",null,null,"1/4 J3"]
[16,{"$f":"IF(H516=\"\",IF(D516=\"\",CONCATENATE(\"Winner \", N516),IF(D516>F516,B516,C516)),IF(H516>I516,B516,C516))","v":"Claudio Panebianco (ITA)"},{"$f":"IF(H517=\"\",IF(D517=\"\",CONCATENATE(\"Winner \", N517),IF(D517>F517,B517,C517)),IF(H517>I517,B517,C517))","v":"Kai Hagenkötter (GER)"},3,"-",5,null,null,null,null,"Patrick de Jong (NED)",null,null,"1/4 J4"]
[]
[null,"1/4 final U15"]
[]
[17,{"$f":"IF(H521=\"\",IF(D521=\"\",CONCATENATE(\"Winner \", N521),IF(D521>F521,B521,C521)),IF(H521>I521,B521,C521))","v":"Maxime Rairoux (BEL)"},{"$f":"IF(H522=\"\",IF(D522=\"\",CONCATENATE(\"Winner \", N522),IF(D522>F522,B522,C522)),IF(H522>I522,B522,C522))","v":"Marios Strommer (AUT)"},3,"-",4,"sd",null,null,null,"Stefano De Francesco (ITA)",null,null,"1/4 C1"]
[18,{"$f":"IF(H523=\"\",IF(D523=\"\",CONCATENATE(\"Winner \", N523),IF(D523>F523,B523,C523)),IF(H523>I523,B523,C523))","v":"Leonardo Giudice (ITA)"},{"$f":"IF(H524=\"\",IF(D524=\"\",CONCATENATE(\"Winner \", N524),IF(D524>F524,B524,C524)),IF(H524>I524,B524,C524))","v":"Jurgen Balzan (MLT)"},6,"-",0,null,null,null,null,"Afonso Pereira (POR)",null,null,"1/4 C2"]
[19,{"$f":"IF(H525=\"\",IF(D525=\"\",CONCATENATE(\"Winner \", N525),IF(D525>F525,B525,C525)),IF(H525>I525,B525,C525))","v":"Claudio La Torre (ITA)"},{"$f":"IF(H526=\"\",IF(D526=\"\",CONCATENATE(\"Winner \", N526),IF(D526>F526,B526,C526)),IF(H526>I526,B526,C526))","v":"Alwin Krause (GER)"},5,"-",0,null,null,null,null,"Florian Giaux (BEL)",{"$f":"IF(H512=\"\",IF(D512=\"\",CONCATENATE(\"Loser \", N512),IF(D512<F512,B512,C512)),IF(H512<I512,B512,C512))","v":"Martin Antoine (BEL)"},null,"1/4 C3"]
[20,{"$f":"IF(H527=\"\",IF(D527=\"\",CONCATENATE(\"Winner \", N527),IF(D527>F527,B527,C527)),IF(H527>I527,B527,C527))","v":"Moritz Jung (GER)"},{"$f":"IF(H528=\"\",IF(D528=\"\",CONCATENATE(\"Winner \", N528),IF(D528>F528,B528,C528)),IF(H528>I528,B528,C528))","v":"Andrea Bolognino (ITA)"},3,"-",4,null,null,null,null,"David González (ESP)",null,null,"1/4 C4"]
[]
[null,"1/4 final U12"]
[]
[21,{"$f":"'Individual Groups'!Q601","v":"Matteo Cammarata (ITA)"},{"$f":"IF(H537=\"\",IF(D537=\"\",CONCATENATE(\"Winner \", N537),IF(D537>F537,B537,C537)),IF(H537>I537,B537,C537))","v":"Lucas Pere (BEL)"},2,"-",1,null,null,null,null,"Théo Modeste (FRA)",null,null,"1/4 M1"]
[22,{"$f":"IF(H534=\"\",IF(D534=\"\",CONCATENATE(\"Winner \", N534),IF(D534>F534,B534,C534)),IF(H534>I534,B534,C534))","v":"Francesco Tozzi (ITA)"},{"$f":"IF(H533=\"\",IF(D533=\"\",CONCATENATE(\"Winner \", N533),IF(D533>F533,B533,C533)),IF(H533>I533,B533,C533))","v":"Kristian Silagiev (ESP)"},1,"-",2,"sd",null,null,null,"Steffen Despretz (BEL)",null,null,"1/4 M2"]
[23,{"$f":"IF(H532=\"\",IF(D532=\"\",CONCATENATE(\"Winner \", N532),IF(D532>F532,B532,C532)),IF(H532>I532,B532,C532))","v":"Basile Magermans (BEL)"},{"$f":"IF(H535=\"\",IF(D535=\"\",CONCATENATE(\"Winner \", N535),IF(D535>F535,B535,C535)),IF(H535>I535,B535,C535))","v":"Giorgio Giudice (ITA)"},0,"-",2,null,null,null,null,"Nikos Haratsis (GRE)",null,null,"1/4 M3"]
[24,{"$f":"IF(H536=\"\",IF(D536=\"\",CONCATENATE(\"Winner \", N536),IF(D536>F536,B536,C536)),IF(H536>I536,B536,C536))","v":"Cristian Fricano  (ITA)"},{"$f":"'Individual Groups'!Q610","v":"Mattia Ferrante (ITA)"},1,"-",2,null,null,null,null,"Phil Redman (ENG)",null,null,"1/4 M4"]
[]
[]
["Série 10 - 18h00"]
[]
["Tables"]
[null,null,null,null,null,null,null,null,null,null,null,"Referees"]
[]
[null,"1/2 final open"]
[]
[1,{"$f":"IF(H549=\"\",IF(D549=\"\",CONCATENATE(\"Winner \", N549),IF(D549>F549,B549,C549)),IF(H549>I549,B549,C549))","v":"Juan Manuel Noguera (ESP)"},{"$f":"IF(H550=\"\",IF(D550=\"\",CONCATENATE(\"Winner \", N550),IF(D550>F550,B550,C550)),IF(H550>I550,B550,C550))","v":"Wolfgang Leitner (AUT)"},3,"-",4,null,null,null,null,"Christophe Dheur (BEL)"]
[2,{"$f":"IF(H551=\"\",IF(D551=\"\",CONCATENATE(\"Winner \", N551),IF(D551>F551,B551,C551)),IF(H551>I551,B551,C551))","v":"Luca Colangelo (ITA)"},{"$f":"IF(H552=\"\",IF(D552=\"\",CONCATENATE(\"Winner \", N552),IF(D552>F552,B552,C552)),IF(H552>I552,B552,C552))","v":"Derek Conti (MLT)"},3,"-",2,null,null,null,null,"Sébastien Scheen (BEL)"]
[]
[null,"1/2 final veteran"]
[]
[3,{"$f":"IF(H556=\"\",IF(D556=\"\",CONCATENATE(\"Winner \", N556),IF(D556>F556,B556,C556)),IF(H556>I556,B556,C556))","v":"Massimo Cremona (MLT)"},{"$f":"IF(H557=\"\",IF(D557=\"\",CONCATENATE(\"Winner \", N557),IF(D557>F557,B557,C557)),IF(H557>I557,B557,C557))","v":"Alain Jadot (BEL)"},3,"-",2,null,null,null,null,"Daniele Bertelli (ITA)"]
[4,{"$f":"IF(H558=\"\",IF(D558=\"\",CONCATENATE(\"Winner \", N558),IF(D558>F558,B558,C558)),IF(H558>I558,B558,C558))","v":"Gianfranco Calonico (ITA)"},{"$f":"IF(H559=\"\",IF(D559=\"\",CONCATENATE(\"Winner \", N559),IF(D559>F559,B559,C559)),IF(H559>I559,B559,C559))","v":"David Busch (AUT)"},3,"-",1,null,null,null,null,"John Field (GIB)"]
[]
[null,"1/2 final ladies"]
[]
[5,{"$f":"IF(H563=\"\",IF(D563=\"\",CONCATENATE(\"Winner \", N563),IF(D563>F563,B563,C563)),IF(H563>I563,B563,C563))","v":"Emilie Despretz (BEL)"},{"$f":"IF(H564=\"\",IF(D564=\"\",CONCATENATE(\"Winner \", N564),IF(D564>F564,B564,C564)),IF(H564>I564,B564,C564))","v":"Victoria Büsing (GER)"},1,"-",3,null,null,null,null,"Massimo Bolognino (ITA)"]
[6,{"$f":"IF(H565=\"\",IF(D565=\"\",CONCATENATE(\"Winner \", N565),IF(D565>F565,B565,C565)),IF(H565>I565,B565,C565))","v":"Carolina Villarigues (POR)"},{"$f":"IF(H566=\"\",IF(D566=\"\",CONCATENATE(\"Winner \", N566),IF(D566>F566,B566,C566)),IF(H566>I566,B566,C566))","v":"Eleonora Buttitta (ITA)"},1,"-",0,null,null,null,null,"Vicenç Prats Salat (ESP)"]
[]
[null,"1/2 final U19"]
[]
[7,{"$f":"IF(H570=\"\",IF(D570=\"\",CONCATENATE(\"Winner \", N570),IF(D570>F570,B570,C570)),IF(H570>I570,B570,C570))","v":"Matteo Ciccarelli (ITA)"},{"$f":"IF(H571=\"\",IF(D571=\"\",CONCATENATE(\"Winner \", N571),IF(D571>F571,B571,C571)),IF(H571>I571,B571,C571))","v":"Antonio Casin (ESP)"},4,"-",2,null,null,null,null,{"$f":"IF(H557=\"\",IF(D557=\"\",CONCATENATE(\"Loser\",N557),IF(D557<F557,B557,C557)),IF(H557<I557,B557,C557))","v":"Günther Bamberzky (AUT)"}]
[8,{"$f":"IF(H572=\"\",IF(D572=\"\",CONCATENATE(\"Winner \", N572),IF(D572>F572,B572,C572)),IF(H572>I572,B572,C572))","v":"Nicola Borgo (ITA)"},{"$f":"IF(H573=\"\",IF(D573=\"\",CONCATENATE(\"Winner \", N573),IF(D573>F573,B573,C573)),IF(H573>I573,B573,C573))","v":"Kai Hagenkötter (GER)"},3,"-",2,"sd",null,null,null,"Éric Naszalyi (FRA)"]
[]
[null,"1/2 final U15"]
[]
[9,{"$f":"IF(H577=\"\",IF(D577=\"\",CONCATENATE(\"Winner \", N577),IF(D577>F577,B577,C577)),IF(H577>I577,B577,C577))","v":"Marios Strommer (AUT)"},{"$f":"IF(H578=\"\",IF(D578=\"\",CONCATENATE(\"Winner \", N578),IF(D578>F578,B578,C578)),IF(H578>I578,B578,C578))","v":"Leonardo Giudice (ITA)"},3,"-",7,null,null,null,null,"Audrey Herbaut (FRA)"]
[10,{"$f":"IF(H579=\"\",IF(D579=\"\",CONCATENATE(\"Winner \", N579),IF(D579>F579,B579,C579)),IF(H579>I579,B579,C579))","v":"Claudio La Torre (ITA)"},{"$f":"IF(H580=\"\",IF(D580=\"\",CONCATENATE(\"Winner \", N580),IF(D580>F580,B580,C580)),IF(H580>I580,B580,C580))","v":"Andrea Bolognino (ITA)"},5,"-",0,null,null,null,null,"Andrea Ciccarelli (ITA)"]
[]
[null,"1/2 final U12"]
[]
[11,{"$f":"IF(H584=\"\",IF(D584=\"\",CONCATENATE(\"Winner \", N584),IF(D584>F584,B584,C584)),IF(H584>I584,B584,C584))","v":"Matteo Cammarata (ITA)"},{"$f":"IF(H585=\"\",IF(D585=\"\",CONCATENATE(\"Winner \", N585),IF(D585>F585,B585,C585)),IF(H585>I585,B585,C585))","v":"Kristian Silagiev (ESP)"},1,"-",3,null,null,null,null,"William Van den Houte (BEL)"]
[12,{"$f":"IF(H586=\"\",IF(D586=\"\",CONCATENATE(\"Winner \", N586),IF(D586>F586,B586,C586)),IF(H586>I586,B586,C586))","v":"Giorgio Giudice (ITA)"},{"$f":"IF(H587=\"\",IF(D587=\"\",CONCATENATE(\"Winner \", N587),IF(D587>F587,B587,C587)),IF(H587>I587,B587,C587))","v":"Mattia Ferrante (ITA)"},2,"-",1,null,null,null,null,"Giuditta Lo Cascio (ITA)"]
[]
[]
["Série 11 - 19h00"]
[]
["Tables"]
[null,null,null,null,null,null,null,null,null,null,null,"Referees"]
[]
[null,"Final open"]
[]
[1,{"$f":"IF(H597=\"\",IF(D597=\"\",CONCATENATE(\"Winner \", N597),IF(D597>F597,B597,C597)),IF(H597>I597,B597,C597))","v":"Wolfgang Leitner (AUT)"},{"$f":"IF(H598=\"\",IF(D598=\"\",CONCATENATE(\"Winner \", N598),IF(D598>F598,B598,C598)),IF(H598>I598,B598,C598))","v":"Luca Colangelo (ITA)"},2,"-",1,null,null,null,null,"Velissarios Fragakis (GRE)",{"$f":"IF(H602=\"\",IF(D602=\"\",CONCATENATE(\"Loser\",N602),IF(D602<F602,B602,C602)),IF(H602<I602,B602,C602))","v":"Alain Jadot (BEL)"}]
[]
[null,"Final veteran"]
[]
[2,{"$f":"IF(H602=\"\",IF(D602=\"\",CONCATENATE(\"Winner \", N602),IF(D602>F602,B602,C602)),IF(H602>I602,B602,C602))","v":"Massimo Cremona (MLT)"},{"$f":"IF(H603=\"\",IF(D603=\"\",CONCATENATE(\"Winner \", N603),IF(D603>F603,B603,C603)),IF(H603>I603,B603,C603))","v":"Gianfranco Calonico (ITA)"},2,"-",6,null,null,null,null,"Henk Landzaat (NED)",{"$f":"IF(H597=\"\",IF(D597=\"\",CONCATENATE(\"Loser\",N597),IF(D597<F597,B597,C597)),IF(H597<I597,B597,C597))","v":"Juan Manuel Noguera (ESP)"}]
[]
[null,"Final ladies"]
[]
[3,{"$f":"IF(H607=\"\",IF(D607=\"\",CONCATENATE(\"Winner \", N607),IF(D607>F607,B607,C607)),IF(H607>I607,B607,C607))","v":"Victoria Büsing (GER)"},{"$f":"IF(H608=\"\",IF(D608=\"\",CONCATENATE(\"Winner \", N608),IF(D608>F608,B608,C608)),IF(H608>I608,B608,C608))","v":"Carolina Villarigues (POR)"},0,"-",3,null,null,null,null,"Antonio Montaño (ESP)",{"$f":"IF(H598=\"\",IF(D598=\"\",CONCATENATE(\"Loser\",N598),IF(D598<F598,B598,C598)),IF(H598<I598,B598,C598))","v":"Derek Conti (MLT)"}]
[]
[null,"Final U19"]
[]
[4,{"$f":"IF(H612=\"\",IF(D612=\"\",CONCATENATE(\"Winner \", N612),IF(D612>F612,B612,C612)),IF(H612>I612,B612,C612))","v":"Matteo Ciccarelli (ITA)"},{"$f":"IF(H613=\"\",IF(D613=\"\",CONCATENATE(\"Winner \", N613),IF(D613>F613,B613,C613)),IF(H613>I613,B613,C613))","v":"Nicola Borgo (ITA)"},3,"-",0,null,null,null,null,"John Field (GIB)",{"$f":"IF(H603=\"\",IF(D603=\"\",CONCATENATE(\"Loser\",N603),IF(D603<F603,B603,C603)),IF(H603<I603,B603,C603))","v":"David Busch (AUT)"}]
[]
[null,"Final U15",null,null,null,null,null,null,null,null,null,{"$f":"IF(H612=\"\",IF(D612=\"\",CONCATENATE(\"Loser\",N612),IF(D612<F612,B612,C612)),IF(H612<I612,B612,C612))","v":"Antonio Casin (ESP)"}]
[]
[5,{"$f":"IF(H617=\"\",IF(D617=\"\",CONCATENATE(\"Winner \", N617),IF(D617>F617,B617,C617)),IF(H617>I617,B617,C617))","v":"Leonardo Giudice (ITA)"},{"$f":"IF(H618=\"\",IF(D618=\"\",CONCATENATE(\"Winner \", N618),IF(D618>F618,B618,C618)),IF(H618>I618,B618,C618))","v":"Claudio La Torre (ITA)"},3,"-",2,null,null,null,null,"Patrizio Lazzaretti (ITA)",{"$f":"IF(H607=\"\",IF(D607=\"\",CONCATENATE(\"Loser\",N607),IF(D607<F607,B607,C607)),IF(H607<I607,B607,C607))","v":"Emilie Despretz (BEL)"}]
[]
[null,"Final U12",null,null,null,null,null,null,null,null,null,{"$f":"IF(H613=\"\",IF(D613=\"\",CONCATENATE(\"Loser\",N613),IF(D613<F613,B613,C613)),IF(H613<I613,B613,C613))","v":"Kai Hagenkötter (GER)"}]
[]
[6,{"$f":"IF(H622=\"\",IF(D622=\"\",CONCATENATE(\"Winner \", N622),IF(D622>F622,B622,C622)),IF(H622>I622,B622,C622))","v":"Kristian Silagiev (ESP)"},{"$f":"IF(H623=\"\",IF(D623=\"\",CONCATENATE(\"Winner \", N623),IF(D623>F623,B623,C623)),IF(H623>I623,B623,C623))","v":"Giorgio Giudice (ITA)"},2,"-",3,null,null,null,null,"Giorgos Drazinakis (GRE)",{"$f":"IF(H608=\"\",IF(D608=\"\",CONCATENATE(\"Loser\",N608),IF(D608<F608,B608,C608)),IF(H608<I608,B608,C608))","v":"Eleonora Buttitta (ITA)"}]

{"sheet":"Team Groups","index":2,"n_rows":163,"n_cols":21,"rows_kept":163,"cut":false,"hidden":false,"merged":[]}
["Draw open teams"]
[]
["Group 1","SPAIN (Open)","GERMANY (Open)","USA (Open)"]
["Group 2","AUSTRIA (Open)","SCOTLAND (Open)","GREECE (Open)","RUSSIA (Open)"]
["Group 3","ITALY (Open)","JAPAN (Open)","NETHERLAND (Open)","ENGLAND (Open)"]
["Group 4","BELGIUM (Open)","FRANCE (Open)","PORTUGAL (Open)","GILBRALTAR (Open)"]
[]
[]
["Draw veteran teams"]
[]
["Group 1","SPAIN (Veteran)","FRANCE (Veteran)","BELGIUM (Veteran)"]
["Group 2","ITALY (Veteran)","GREECE (Veteran)","GILBRALTAR (Veteran)","MALTA (Veteran)"]
["Group 3","AUSTRIA (Veteran)","ENGLAND (Veteran)","GERMANY (Veteran)","USA (Veteran)"]
[]
[]
["Draw ladies teams"]
[]
["Group 1","ITALY (Ladies)","GERMANY (Ladies)","BELGIUM (Ladies)","FRANCE (Ladies)"]
[]
[]
["Draw U19 teams"]
[]
["Group 1","ITALY (U19)","ENGLAND (U19)","MALTA (U19)"]
["Group 2","BELGIUM (U19)","GERMANY (U19)","PORTUGAL (U19)","FRANCE (U19)"]
[]
[]
["Draw U15 teams"]
[]
["Group 1","ITALY (U15)","ENGLAND (U15)","BELGIUM (U15)","SPAIN  (U15)","AUSTRIA  (U15)","FRANCE (U15)"]
[]
[]
["Draw U12 teams"]
[]
["Group 1","ITALY (U12)","FRANCE (U12)","SPAIN  (U12)","BELGIUM (U12)"]
[]
[]
[]
["1st round"]
[]
["Open category"]
[]
["Group 1"]
[null,"Team","Ind",null,"Ind","Team"]
[{"$f":"B3","v":"SPAIN (Open)"},{"$f":"'Séries équipes full'!C91","v":2},{"$f":"'Séries équipes full'!D91","v":18},"-",{"$f":"'Séries équipes full'!F91","v":12},{"$f":"'Séries équipes full'!G91","v":2},{"$f":"D3","v":"USA (Open)"},null,null,null,"P","W","L","N","m win","m lose","ind av","+","-","av","PTS"]
[{"$f":"D3","v":"USA (Open)"},{"$f":"'Séries équipes full'!C181","v":1},{"$f":"'Séries équipes full'!D181","v":8},"-",{"$f":"'Séries équipes full'!F181","v":9},{"$f":"'Séries équipes full'!G181","v":2},{"$f":"C3","v":"GERMANY (Open)"},"SPAIN (Open)",null,{"$f":"A44","v":"SPAIN (Open)"},{"$f":"IF(C44=\"\",0,1)+IF(C46=\"\",0,1)","v":2},{"$f":"IF(B44>F44,1,0)+IF(F46>B46,1,0)","v":1},{"$f":"IF(B44<F44,1,0)+IF(F46<B46,1,0)","v":0},{"$f":"IF(B44=\"\",0,IF(B44=F44,1,0))+IF(B46=\"\",0,IF(B46=F46,1,0))","v":1},{"$f":"B44+F46","v":6},{"$f":"F44+B46","v":2},{"$f":"O45-P45","v":4},{"$f":"B44+F46","v":6},{"$f":"F44+B46","v":2},{"$f":"R45-S45","v":4},{"$f":"L45*3+N45","v":4}]
[{"$f":"C3","v":"GERMANY (Open)"},{"$f":"'Séries équipes full'!C375","v":0},{"$f":"'Séries équipes full'!D375","v":8},"-",{"$f":"'Séries équipes full'!F375","v":26},{"$f":"'Séries équipes full'!G375","v":4},{"$f":"B3","v":"SPAIN (Open)"},"GERMANY (Open)",null,{"$f":"G45","v":"GERMANY (Open)"},{"$f":"IF(E45=\"\",0,1)+IF(C46=\"\",0,1)","v":2},{"$f":"IF(F45>B45,1,0)+IF(B46>F46,1,0)","v":1},{"$f":"IF(F45<B45,1,0)+IF(B46<F46,1,0)","v":1},{"$f":"IF(B45=\"\",0,IF(B45=F45,1,0))+IF(B46=\"\",0,IF(B46=F46,1,0))","v":0},{"$f":"F45+B46","v":2},{"$f":"B45+F46","v":5},{"$f":"O46-P46","v":-3},{"$f":"F45+B46","v":2},{"$f":"B45+F46","v":5},{"$f":"R46-S46","v":-3},{"$f":"L46*3+N46","v":3}]
[null,null,null,null,null,null,null,"USA (Open)",null,{"$f":"A45","v":"USA (Open)"},{"$f":"IF(C45=\"\",0,1)+IF(E44=\"\",0,1)","v":2},{"$f":"IF(F44>B44,1,0)+IF(B45>F45,1,0)","v":0},{"$f":"IF(F44<B44,1,0)+IF(B45<F45,1,0)","v":1},{"$f":"IF(B44=\"\",0,IF(B44=F44,1,0))+IF(B45=\"\",0,IF(B45=F45,1,0))","v":1},{"$f":"F44+B45","v":3},{"$f":"B44+F45","v":4},-1,{"$f":"F44+B45","v":3},{"$f":"B44+F45","v":4},-1,{"$f":"L47*3+N47","v":1}]
["Group 2",null,null,null,null,null,null,null,null,null,{"$f":"SUM(K44:K47)","v":6},2,2,2,11,11,0,11,11,0]
[null,"Team","Ind",null,"Ind","Team"]
[{"$f":"B4","v":"AUSTRIA (Open)"},{"$f":"'Séries équipes full'!C6","v":4},{"$f":"'Séries équipes full'!D6","v":26},"-",{"$f":"'Séries équipes full'!F6","v":2},{"$f":"'Séries équipes full'!G6","v":0},{"$f":"C4","v":"SCOTLAND (Open)"},null,null,null,"P","W","L","N","m win","m lose","ind av","+","-","av","PTS"]
[{"$f":"D4","v":"GREECE (Open)"},{"$f":"'Séries équipes full'!C13","v":4},{"$f":"'Séries équipes full'!D13","v":19},"-",{"$f":"'Séries équipes full'!F13","v":1},{"$f":"'Séries équipes full'!G13","v":0},{"$f":"E4","v":"RUSSIA (Open)"},"AUSTRIA (Open)",null,{"$f":"A50","v":"AUSTRIA (Open)"},{"$f":"IF(C50=\"\",0,1)+IF(C52=\"\",0,1)+IF(E54=\"\",0,1)","v":3},{"$f":"IF(B50>F50,1,0)+IF(B52>F52,1,0)+IF(F54>B54,1,0)","v":3},{"$f":"IF(B50<F50,1,0)+IF(B52<F52,1,0)+IF(F54<B54,1,0)","v":0},{"$f":"IF(B50=\"\",0,IF(B50=F50,1,0))+IF(B52=\"\",0,IF(B52=F52,1,0))+IF(B54=\"\",0,IF(B54=F54,1,0))","v":0},{"$f":"C50+C52+E54","v":69},{"$f":"E50+E52+C54","v":6},{"$f":"O51-P51","v":63},{"$f":"B50+B52+F54","v":11},{"$f":"F50+F52+B54","v":1},{"$f":"R51-S51","v":10},{"$f":"L51*3+N51","v":9}]
[{"$f":"B4","v":"AUSTRIA (Open)"},{"$f":"'Séries équipes full'!C112","v":3},{"$f":"'Séries équipes full'!D112","v":6},"-",{"$f":"'Séries équipes full'!F112","v":4},{"$f":"'Séries équipes full'!G112","v":1},{"$f":"D4","v":"GREECE (Open)"},"GREECE (Open)",null,{"$f":"G50","v":"SCOTLAND (Open)"},{"$f":"IF(E50=\"\",0,1)+IF(C53=\"\",0,1)+IF(C55=\"\",0,1)","v":3},{"$f":"IF(F50>B50,1,0)+IF(B53>F53,1,0)+IF(B55>F55,1,0)","v":1},{"$f":"IF(F50<B50,1,0)+IF(B53<F53,1,0)+IF(B55<F55,1,0)","v":2},{"$f":"IF(B50=\"\",0,IF(B50=F50,1,0))+IF(B53=\"\",0,IF(B53=F53,1,0))+IF(B55=\"\",0,IF(B55=F55,1,0))","v":0},{"$f":"E50+C53+C55","v":30},{"$f":"C50+E53+E55","v":46},{"$f":"O52-P52","v":-16},{"$f":"F50+B53+B55","v":4},{"$f":"B50+F53+F55","v":8},{"$f":"R52-S52","v":-4},{"$f":"L52*3+N52","v":3}]
[{"$f":"C4","v":"SCOTLAND (Open)"},{"$f":"'Séries équipes full'!C119","v":4},{"$f":"'Séries équipes full'!D119","v":25},"-",{"$f":"'Séries équipes full'!F119","v":4},{"$f":"'Séries équipes full'!G119","v":0},{"$f":"E4","v":"RUSSIA (Open)"},"SCOTLAND (Open)",null,{"$f":"A51","v":"GREECE (Open)"},{"$f":"IF(C51=\"\",0,1)+IF(E52=\"\",0,1)+IF(E55=\"\",0,1)","v":3},{"$f":"IF(B51>F51,1,0)+IF(F52>B52,1,0)+IF(F55>B55,1,0)","v":2},{"$f":"IF(B51<F51,1,0)+IF(F52<B52,1,0)+IF(F55<B55,1,0)","v":1},{"$f":"IF(B51=\"\",0,IF(B51=F51,1,0))+IF(B52=\"\",0,IF(B52=F52,1,0))+IF(B55=\"\",0,IF(B55=F55,1,0))","v":0},{"$f":"C51+E52+E55","v":39},{"$f":"E51+C52+C55","v":10},29,{"$f":"B51+F52+F55","v":9},{"$f":"F51+B52+B55","v":3},6,{"$f":"L53*3+N53","v":6}]
[{"$f":"E4","v":"RUSSIA (Open)"},{"$f":"'Séries équipes full'!C278","v":0},{"$f":"'Séries équipes full'!D278","v":0},"-",{"$f":"'Séries équipes full'!F278","v":37},{"$f":"'Séries équipes full'!G278","v":4},{"$f":"B4","v":"AUSTRIA (Open)"},"RUSSIA (Open)",null,{"$f":"G51","v":"RUSSIA (Open)"},{"$f":"IF(E51=\"\",0,1)+IF(E53=\"\",0,1)+IF(C54=\"\",0,1)","v":3},{"$f":"IF(F51>B51,1,0)+IF(F53>B53,1,0)+IF(B54>F54,1,0)","v":0},{"$f":"IF(F51<B51,1,0)+IF(F53<B53,1,0)+IF(B54<F54,1,0)","v":3},{"$f":"IF(B51=\"\",0,IF(B51=F51,1,0))+IF(B53=\"\",0,IF(B53=F53,1,0))+IF(B54=\"\",0,IF(B54=F54,1,0))","v":0},{"$f":"E51+E53+C54","v":5},{"$f":"C51+C53+E54","v":81},-76,{"$f":"F51+F53+B54","v":0},{"$f":"B51+B53+F54","v":12},-12,{"$f":"L54*3+N54","v":0}]
[{"$f":"C4","v":"SCOTLAND (Open)"},{"$f":"'Séries équipes full'!C285","v":0},{"$f":"'Séries équipes full'!D285","v":3},"-",{"$f":"'Séries équipes full'!F285","v":16},{"$f":"'Séries équipes full'!G285","v":4},{"$f":"D4","v":"GREECE (Open)"},null,null,null,{"$f":"SUM(K51:K54)","v":12},6,6,0,143,143,0,24,24,0]
[]
["Group 3"]
[null,"Team","Ind",null,"Ind","Team"]
[{"$f":"B5","v":"ITALY (Open)"},{"$f":"'Séries équipes full'!C20","v":4},{"$f":"'Séries équipes full'!D20","v":43},"-",{"$f":"'Séries équipes full'!F20","v":0},{"$f":"'Séries équipes full'!G20","v":0},{"$f":"C5","v":"JAPAN (Open)"},null,null,null,"P","W","L","N","m win","m lose","ind av","+","-","av","PTS"]
[{"$f":"D5","v":"NETHERLAND (Open)"},{"$f":"'Séries équipes full'!C27","v":3},{"$f":"'Séries équipes full'!D27","v":18},"-",{"$f":"'Séries équipes full'!F27","v":6},{"$f":"'Séries équipes full'!G27","v":0},{"$f":"E5","v":"ENGLAND (Open)"},"ITALY (Open)",null,{"$f":"A59","v":"ITALY (Open)"},{"$f":"IF(C59=\"\",0,1)+IF(C61=\"\",0,1)+IF(E63=\"\",0,1)","v":3},{"$f":"IF(B59>F59,1,0)+IF(B61>F61,1,0)+IF(F63>B63,1,0)","v":3},{"$f":"IF(B59<F59,1,0)+IF(B61<F61,1,0)+IF(F63<B63,1,0)","v":0},{"$f":"IF(B59=\"\",0,IF(B59=F59,1,0))+IF(B61=\"\",0,IF(B61=F61,1,0))+IF(B63=\"\",0,IF(B63=F63,1,0))","v":0},{"$f":"C59+C61+E63","v":96},{"$f":"E59+E61+C63","v":11},{"$f":"O60-P60","v":85},{"$f":"B59+B61+F63","v":11},{"$f":"F59+F61+B63","v":1},{"$f":"R60-S60","v":10},{"$f":"L60*3+N60","v":9}]
[{"$f":"B5","v":"ITALY (Open)"},{"$f":"'Séries équipes full'!C188","v":3},{"$f":"'Séries équipes full'!D188","v":14},"-",{"$f":"'Séries équipes full'!F188","v":8},{"$f":"'Séries équipes full'!G188","v":1},{"$f":"D5","v":"NETHERLAND (Open)"},"NETHERLAND (Open)",null,{"$f":"G59","v":"JAPAN (Open)"},{"$f":"IF(E59=\"\",0,1)+IF(C62=\"\",0,1)+IF(C64=\"\",0,1)","v":3},{"$f":"IF(F59>B59,1,0)+IF(B62>F62,1,0)+IF(B64>F64,1,0)","v":0},{"$f":"IF(F59<B59,1,0)+IF(B62<F62,1,0)+IF(B64<F64,1,0)","v":3},{"$f":"IF(B59=\"\",0,IF(B59=F59,1,0))+IF(B62=\"\",0,IF(B62=F62,1,0))+IF(B64=\"\",0,IF(B64=F64,1,0))","v":0},{"$f":"E59+C62+C64","v":2},{"$f":"C59+E62+E64","v":67},{"$f":"O61-P61","v":-65},{"$f":"F59+B62+B64","v":0},{"$f":"B59+F62+F64","v":12},{"$f":"R61-S61","v":-12},{"$f":"L61*3+N61","v":0}]
[{"$f":"C5","v":"JAPAN (Open)"},{"$f":"'Séries équipes full'!C195","v":0},{"$f":"'Séries équipes full'!D195","v":2},"-",{"$f":"'Séries équipes full'!F195","v":12},{"$f":"'Séries équipes full'!G195","v":4},{"$f":"E5","v":"ENGLAND (Open)"},"ENGLAND (Open)",null,{"$f":"A60","v":"NETHERLAND (Open)"},{"$f":"IF(C60=\"\",0,1)+IF(E61=\"\",0,1)+IF(E64=\"\",0,1)","v":3},{"$f":"IF(B60>F60,1,0)+IF(F61>B61,1,0)+IF(F64>B64,1,0)","v":2},{"$f":"IF(B60<F60,1,0)+IF(F61<B61,1,0)+IF(F64<B64,1,0)","v":1},{"$f":"IF(B60=\"\",0,IF(B60=F60,1,0))+IF(B61=\"\",0,IF(B61=F61,1,0))+IF(B64=\"\",0,IF(B64=F64,1,0))","v":0},{"$f":"C60+E61+E64","v":38},{"$f":"E60+C61+C64","v":20},18,{"$f":"B60+F61+F64","v":8},{"$f":"F60+B61+B64","v":3},5,{"$f":"L62*3+N62","v":6}]
[{"$f":"E5","v":"ENGLAND (Open)"},{"$f":"'Séries équipes full'!C292","v":0},{"$f":"'Séries équipes full'!D292","v":3},"-",{"$f":"'Séries équipes full'!F292","v":39},{"$f":"'Séries équipes full'!G292","v":4},{"$f":"B5","v":"ITALY (Open)"},"JAPAN (Open)",null,{"$f":"G60","v":"ENGLAND (Open)"},{"$f":"IF(E60=\"\",0,1)+IF(E62=\"\",0,1)+IF(C63=\"\",0,1)","v":3},{"$f":"IF(F60>B60,1,0)+IF(F62>B62,1,0)+IF(B63>F63,1,0)","v":1},{"$f":"IF(F60<B60,1,0)+IF(F62<B62,1,0)+IF(B63<F63,1,0)","v":2},{"$f":"IF(B60=\"\",0,IF(B60=F60,1,0))+IF(B62=\"\",0,IF(B62=F62,1,0))+IF(B63=\"\",0,IF(B63=F63,1,0))","v":0},{"$f":"E60+E62+C63","v":21},{"$f":"C60+C62+E63","v":59},-38,{"$f":"F60+F62+B63","v":4},{"$f":"B60+B62+F63","v":7},-3,{"$f":"L63*3+N63","v":3}]
[{"$f":"C5","v":"JAPAN (Open)"},{"$f":"'Séries équipes full'!C299","v":0},{"$f":"'Séries équipes full'!D299","v":0},"-",{"$f":"'Séries équipes full'!F299","v":12},{"$f":"'Séries équipes full'!G299","v":4},{"$f":"D5","v":"NETHERLAND (Open)"},null,null,null,{"$f":"SUM(K60:K63)","v":12},6,6,0,157,157,0,23,23,0]
[]
["Group 4"]
[null,"Team","Ind",null,"Ind","Team"]
[{"$f":"B6","v":"BELGIUM (Open)"},{"$f":"'Séries équipes full'!C98","v":3},{"$f":"'Séries équipes full'!D98","v":7},"-",{"$f":"'Séries équipes full'!F98","v":3},{"$f":"'Séries équipes full'!G98","v":1},{"$f":"C6","v":"FRANCE (Open)"},null,null,null,"P","W","L","N","m win","m lose","ind av","+","-","av","PTS"]
[{"$f":"D6","v":"PORTUGAL (Open)"},{"$f":"'Séries équipes full'!C105","v":2},{"$f":"'Séries équipes full'!D105","v":19},"-",{"$f":"'Séries équipes full'!F105","v":6},{"$f":"'Séries équipes full'!G105","v":1},{"$f":"E6","v":"GILBRALTAR (Open)"},"BELGIUM (Open)",null,{"$f":"A68","v":"BELGIUM (Open)"},{"$f":"IF(C68=\"\",0,1)+IF(C70=\"\",0,1)+IF(E72=\"\",0,1)","v":3},{"$f":"IF(B68>F68,1,0)+IF(B70>F70,1,0)+IF(F72>B72,1,0)","v":3},{"$f":"IF(B68<F68,1,0)+IF(B70<F70,1,0)+IF(F72<B72,1,0)","v":0},{"$f":"IF(B68=\"\",0,IF(B68=F68,1,0))+IF(B70=\"\",0,IF(B70=F70,1,0))+IF(B72=\"\",0,IF(B72=F72,1,0))","v":0},{"$f":"C68+C70+E72","v":58},{"$f":"E68+E70+C72","v":14},{"$f":"O69-P69","v":44},{"$f":"B68+B70+F72","v":11},{"$f":"F68+F70+B72","v":1},{"$f":"R69-S69","v":10},{"$f":"L69*3+N69","v":9}]
[{"$f":"B6","v":"BELGIUM (Open)"},{"$f":"'Séries équipes full'!C202","v":4},{"$f":"'Séries équipes full'!D202","v":20},"-",{"$f":"'Séries équipes full'!F202","v":0},{"$f":"'Séries équipes full'!G202","v":0},{"$f":"D6","v":"PORTUGAL (Open)"},"FRANCE (Open)",null,{"$f":"G68","v":"FRANCE (Open)"},{"$f":"IF(E68=\"\",0,1)+IF(C71=\"\",0,1)+IF(C73=\"\",0,1)","v":3},{"$f":"IF(F68>B68,1,0)+IF(B71>F71,1,0)+IF(B73>F73,1,0)","v":2},{"$f":"IF(F68<B68,1,0)+IF(B71<F71,1,0)+IF(B73<F73,1,0)","v":1},{"$f":"IF(B68=\"\",0,IF(B68=F68,1,0))+IF(B71=\"\",0,IF(B71=F71,1,0))+IF(B73=\"\",0,IF(B73=F73,1,0))","v":0},{"$f":"E68+C71+C73","v":36},{"$f":"C68+E71+E73","v":15},{"$f":"O70-P70","v":21},{"$f":"F68+B71+B73","v":8},{"$f":"B68+F71+F73","v":3},{"$f":"R70-S70","v":5},{"$f":"L70*3+N70","v":6}]
[{"$f":"C6","v":"FRANCE (Open)"},{"$f":"'Séries équipes full'!C209","v":4},{"$f":"'Séries équipes full'!D209","v":19},"-",{"$f":"'Séries équipes full'!F209","v":1},{"$f":"'Séries équipes full'!G209","v":0},{"$f":"E6","v":"GILBRALTAR (Open)"},"PORTUGAL (Open)",null,{"$f":"A69","v":"PORTUGAL (Open)"},{"$f":"IF(C69=\"\",0,1)+IF(E70=\"\",0,1)+IF(E73=\"\",0,1)","v":3},{"$f":"IF(B69>F69,1,0)+IF(F70>B70,1,0)+IF(F73>B73,1,0)","v":1},{"$f":"IF(B69<F69,1,0)+IF(F70<B70,1,0)+IF(F73<B73,1,0)","v":2},{"$f":"IF(B69=\"\",0,IF(B69=F69,1,0))+IF(B70=\"\",0,IF(B70=F70,1,0))+IF(B73=\"\",0,IF(B73=F73,1,0))","v":0},{"$f":"C69+E70+E73","v":26},{"$f":"E69+C70+C73","v":40},-14,{"$f":"B69+F70+F73","v":2},{"$f":"F69+B70+B73","v":8},-6,{"$f":"L71*3+N71","v":3}]
[{"$f":"E6","v":"GILBRALTAR (Open)"},{"$f":"'Séries équipes full'!C382","v":0},{"$f":"'Séries équipes full'!D382","v":11},"-",{"$f":"'Séries équipes full'!F382","v":31},{"$f":"'Séries équipes full'!G382","v":4},{"$f":"B6","v":"BELGIUM (Open)"},"GILBRALTAR (Open)",null,{"$f":"G69","v":"GILBRALTAR (Open)"},{"$f":"IF(E69=\"\",0,1)+IF(E71=\"\",0,1)+IF(C72=\"\",0,1)","v":3},{"$f":"IF(F69>B69,1,0)+IF(F71>B71,1,0)+IF(B72>F72,1,0)","v":0},{"$f":"IF(F69<B69,1,0)+IF(F71<B71,1,0)+IF(B72<F72,1,0)","v":3},{"$f":"IF(B69=\"\",0,IF(B69=F69,1,0))+IF(B71=\"\",0,IF(B71=F71,1,0))+IF(B72=\"\",0,IF(B72=F72,1,0))","v":0},{"$f":"E69+E71+C72","v":18},{"$f":"C69+C71+E72","v":69},-51,{"$f":"F69+F71+B72","v":1},{"$f":"B69+B71+F72","v":10},-9,{"$f":"L72*3+N72","v":0}]
[{"$f":"C6","v":"FRANCE (Open)"},{"$f":"'Séries équipes full'!C389","v":3},{"$f":"'Séries équipes full'!D389","v":14},"-",{"$f":"'Séries équipes full'!F389","v":7},{"$f":"'Séries équipes full'!G389","v":0},{"$f":"D6","v":"PORTUGAL (Open)"},null,null,null,{"$f":"SUM(K69:K72)","v":12},6,6,0,138,138,0,22,22,0]
[]
[]
["Veteran category"]
[]
["Group 1"]
[null,"Team","Ind",null,"Ind","Team"]
[{"$f":"B11","v":"SPAIN (Veteran)"},{"$f":"'Séries équipes full'!C126","v":1},{"$f":"'Séries équipes full'!D126","v":3},"-",{"$f":"'Séries équipes full'!F126","v":8},{"$f":"'Séries équipes full'!G126","v":3},{"$f":"D11","v":"BELGIUM (Veteran)"},null,null,null,"P","W","L","N","m win","m lose","ind av","+","-","av","PTS"]
[{"$f":"D11","v":"BELGIUM (Veteran)"},{"$f":"'Séries équipes full'!C216","v":2},{"$f":"'Séries équipes full'!D216","v":7},"-",{"$f":"'Séries équipes full'!F216","v":6},{"$f":"'Séries équipes full'!G216","v":1},{"$f":"C11","v":"FRANCE (Veteran)"},"BELGIUM (Veteran)",null,{"$f":"A80","v":"SPAIN (Veteran)"},{"$f":"IF(C80=\"\",0,1)+IF(C82=\"\",0,1)","v":2},{"$f":"IF(B80>F80,1,0)+IF(F82>B82,1,0)","v":1},{"$f":"IF(B80<F80,1,0)+IF(F82<B82,1,0)","v":1},{"$f":"IF(B80=\"\",0,IF(B80=F80,1,0))+IF(B82=\"\",0,IF(B82=F82,1,0))","v":0},{"$f":"B80+F82","v":3},{"$f":"F80+B82","v":4},{"$f":"O81-P81","v":-1},{"$f":"B80+F82","v":3},{"$f":"F80+B82","v":4},{"$f":"R81-S81","v":-1},{"$f":"L81*3+N81","v":3}]
[{"$f":"C11","v":"FRANCE (Veteran)"},{"$f":"'Séries équipes full'!C306","v":1},{"$f":"'Séries équipes full'!D306","v":8},"-",{"$f":"'Séries équipes full'!F306","v":14},{"$f":"'Séries équipes full'!G306","v":2},{"$f":"B11","v":"SPAIN (Veteran)"},"SPAIN (Veteran)",null,{"$f":"G81","v":"FRANCE (Veteran)"},{"$f":"IF(E81=\"\",0,1)+IF(C82=\"\",0,1)","v":2},{"$f":"IF(F81>B81,1,0)+IF(B82>F82,1,0)","v":0},{"$f":"IF(F81<B81,1,0)+IF(B82<F82,1,0)","v":2},{"$f":"IF(B81=\"\",0,IF(B81=F81,1,0))+IF(B82=\"\",0,IF(B82=F82,1,0))","v":0},{"$f":"F81+B82","v":2},{"$f":"B81+F82","v":4},{"$f":"O82-P82","v":-2},{"$f":"F81+B82","v":2},{"$f":"B81+F82","v":4},{"$f":"R82-S82","v":-2},{"$f":"L82*3+N82","v":0}]
[null,null,null,null,null,null,null,"FRANCE (Veteran)",null,{"$f":"A81","v":"BELGIUM (Veteran)"},{"$f":"IF(C81=\"\",0,1)+IF(E80=\"\",0,1)","v":2},{"$f":"IF(F80>B80,1,0)+IF(B81>F81,1,0)","v":2},{"$f":"IF(F80<B80,1,0)+IF(B81<F81,1,0)","v":0},{"$f":"IF(B80=\"\",0,IF(B80=F80,1,0))+IF(B81=\"\",0,IF(B81=F81,1,0))","v":0},{"$f":"F80+B81","v":5},{"$f":"B80+F81","v":2},3,{"$f":"F80+B81","v":5},{"$f":"B80+F81","v":2},3,{"$f":"L83*3+N83","v":6}]
["Group 2",null,null,null,null,null,null,null,null,null,{"$f":"SUM(K80:K83)","v":6},3,3,0,10,10,0,10,10,0]
[null,"Team","Ind",null,"Ind","Team"]
[{"$f":"B12","v":"ITALY (Veteran)"},{"$f":"'Séries équipes full'!C34","v":2},{"$f":"'Séries équipes full'!D34","v":8},"-",{"$f":"'Séries équipes full'!F34","v":3},{"$f":"'Séries équipes full'!G34","v":0},{"$f":"C12","v":"GREECE (Veteran)"},null,null,null,"P","W","L","N","m win","m lose","ind av","+","-","av","PTS"]
[{"$f":"D12","v":"GILBRALTAR (Veteran)"},{"$f":"'Séries équipes full'!C41","v":1},{"$f":"'Séries équipes full'!D41","v":5},"-",{"$f":"'Séries équipes full'!F41","v":3},{"$f":"'Séries équipes full'!G41","v":1},{"$f":"E12","v":"MALTA (Veteran)"},"ITALY (Veteran)",null,{"$f":"A86","v":"ITALY (Veteran)"},{"$f":"IF(C86=\"\",0,1)+IF(C88=\"\",0,1)+IF(E90=\"\",0,1)","v":3},{"$f":"IF(B86>F86,1,0)+IF(B88>F88,1,0)+IF(F90>B90,1,0)","v":2},{"$f":"IF(B86<F86,1,0)+IF(B88<F88,1,0)+IF(F90<B90,1,0)","v":0},{"$f":"IF(B86=\"\",0,IF(B86=F86,1,0))+IF(B88=\"\",0,IF(B88=F88,1,0))+IF(B90=\"\",0,IF(B90=F90,1,0))","v":1},{"$f":"C86+C88+E90","v":23},{"$f":"E86+E88+C90","v":8},{"$f":"O87-P87","v":15},{"$f":"B86+B88+F90","v":6},{"$f":"F86+F88+B90","v":1},{"$f":"R87-S87","v":5},{"$f":"L87*3+N87","v":7}]
[{"$f":"B12","v":"ITALY (Veteran)"},{"$f":"'Séries équipes full'!C133","v":3},{"$f":"'Séries équipes full'!D133","v":9},"-",{"$f":"'Séries équipes full'!F133","v":1},{"$f":"'Séries équipes full'!G133","v":0},{"$f":"D12","v":"GILBRALTAR (Veteran)"},"GREECE (Veteran)",null,{"$f":"G86","v":"GREECE (Veteran)"},{"$f":"IF(E86=\"\",0,1)+IF(C89=\"\",0,1)+IF(C91=\"\",0,1)","v":3},{"$f":"IF(F86>B86,1,0)+IF(B89>F89,1,0)+IF(B91>F91,1,0)","v":1},{"$f":"IF(F86<B86,1,0)+IF(B89<F89,1,0)+IF(B91<F91,1,0)","v":1},{"$f":"IF(B86=\"\",0,IF(B86=F86,1,0))+IF(B89=\"\",0,IF(B89=F89,1,0))+IF(B91=\"\",0,IF(B91=F91,1,0))","v":1},{"$f":"E86+C89+C91","v":20},{"$f":"C86+E89+E91","v":20},{"$f":"O88-P88","v":0},{"$f":"F86+B89+B91","v":4},{"$f":"B86+F89+F91","v":5},{"$f":"R88-S88","v":-1},{"$f":"L88*3+N88","v":4}]
[{"$f":"C12","v":"GREECE (Veteran)"},{"$f":"'Séries équipes full'!C140","v":2},{"$f":"'Séries équipes full'!D140","v":6},"-",{"$f":"'Séries équipes full'!F140","v":6},{"$f":"'Séries équipes full'!G140","v":2},{"$f":"E12","v":"MALTA (Veteran)"},"MALTA (Veteran)",null,{"$f":"A87","v":"GILBRALTAR (Veteran)"},{"$f":"IF(C87=\"\",0,1)+IF(E88=\"\",0,1)+IF(E91=\"\",0,1)","v":3},{"$f":"IF(B87>F87,1,0)+IF(F88>B88,1,0)+IF(F91>B91,1,0)","v":0},{"$f":"IF(B87<F87,1,0)+IF(F88<B88,1,0)+IF(F91<B91,1,0)","v":2},{"$f":"IF(B87=\"\",0,IF(B87=F87,1,0))+IF(B88=\"\",0,IF(B88=F88,1,0))+IF(B91=\"\",0,IF(B91=F91,1,0))","v":1},{"$f":"C87+E88+E91","v":12},{"$f":"E87+C88+C91","v":23},-11,{"$f":"B87+F88+F91","v":2},{"$f":"F87+B88+B91","v":6},-4,{"$f":"L89*3+N89","v":1}]
[{"$f":"E12","v":"MALTA (Veteran)"},{"$f":"'Séries équipes full'!C313","v":1},{"$f":"'Séries équipes full'!D313","v":4},"-",{"$f":"'Séries équipes full'!F313","v":6},{"$f":"'Séries équipes full'!G313","v":1},{"$f":"B12","v":"ITALY (Veteran)"},"GILBRALTAR (Veteran)",null,{"$f":"G87","v":"MALTA (Veteran)"},{"$f":"IF(E87=\"\",0,1)+IF(E89=\"\",0,1)+IF(C90=\"\",0,1)","v":3},{"$f":"IF(F87>B87,1,0)+IF(F89>B89,1,0)+IF(B90>F90,1,0)","v":0},{"$f":"IF(F87<B87,1,0)+IF(F89<B89,1,0)+IF(B90<F90,1,0)","v":0},{"$f":"IF(B87=\"\",0,IF(B87=F87,1,0))+IF(B89=\"\",0,IF(B89=F89,1,0))+IF(B90=\"\",0,IF(B90=F90,1,0))","v":3},{"$f":"E87+E89+C90","v":13},{"$f":"C87+C89+E90","v":17},-4,{"$f":"F87+F89+B90","v":4},{"$f":"B87+B89+F90","v":4},0,{"$f":"L90*3+N90","v":3}]
[{"$f":"C12","v":"GREECE (Veteran)"},{"$f":"'Séries équipes full'!C320","v":2},{"$f":"'Séries équipes full'!D320","v":11},"-",{"$f":"'Séries équipes full'!F320","v":6},{"$f":"'Séries équipes full'!G320","v":1},{"$f":"D12","v":"GILBRALTAR (Veteran)"},null,null,null,{"$f":"SUM(K87:K90)","v":12},3,3,6,68,68,0,16,16,0]
[]
["Group 3"]
[null,"Team","Ind",null,"Ind","Team"]
[{"$f":"B13","v":"AUSTRIA (Veteran)"},{"$f":"'Séries équipes full'!C48","v":3},{"$f":"'Séries équipes full'!D48","v":10},"-",{"$f":"'Séries équipes full'!F48","v":5},{"$f":"'Séries équipes full'!G48","v":1},{"$f":"C13","v":"ENGLAND (Veteran)"},null,null,null,"P","W","L","N","m win","m lose","ind av","+","-","av","PTS"]
[{"$f":"D13","v":"GERMANY (Veteran)"},{"$f":"'Séries équipes full'!C55","v":3},{"$f":"'Séries équipes full'!D55","v":10},"-",{"$f":"'Séries équipes full'!F55","v":4},{"$f":"'Séries équipes full'!G55","v":0},{"$f":"E13","v":"USA (Veteran)"},"AUSTRIA (Veteran)",null,{"$f":"A95","v":"AUSTRIA (Veteran)"},{"$f":"IF(C95=\"\",0,1)+IF(C97=\"\",0,1)+IF(E99=\"\",0,1)","v":3},{"$f":"IF(B95>F95,1,0)+IF(B97>F97,1,0)+IF(F99>B99,1,0)","v":3},{"$f":"IF(B95<F95,1,0)+IF(B97<F97,1,0)+IF(F99<B99,1,0)","v":0},{"$f":"IF(B95=\"\",0,IF(B95=F95,1,0))+IF(B97=\"\",0,IF(B97=F97,1,0))+IF(B99=\"\",0,IF(B99=F99,1,0))","v":0},{"$f":"C95+C97+E99","v":36},{"$f":"E95+E97+C99","v":19},{"$f":"O96-P96","v":17},{"$f":"B95+B97+F99","v":9},{"$f":"F95+F97+B99","v":1},{"$f":"R96-S96","v":8},{"$f":"L96*3+N96","v":9}]
[{"$f":"B13","v":"AUSTRIA (Veteran)"},{"$f":"'Séries équipes full'!C223","v":3},{"$f":"'Séries équipes full'!D223","v":10},"-",{"$f":"'Séries équipes full'!F223","v":7},{"$f":"'Séries équipes full'!G223","v":0},{"$f":"D13","v":"GERMANY (Veteran)"},"GERMANY (Veteran)",null,{"$f":"G95","v":"ENGLAND (Veteran)"},{"$f":"IF(E95=\"\",0,1)+IF(C98=\"\",0,1)+IF(C100=\"\",0,1)","v":3},{"$f":"IF(F95>B95,1,0)+IF(B98>F98,1,0)+IF(B100>F100,1,0)","v":1},{"$f":"IF(F95<B95,1,0)+IF(B98<F98,1,0)+IF(B100<F100,1,0)","v":2},{"$f":"IF(B95=\"\",0,IF(B95=F95,1,0))+IF(B98=\"\",0,IF(B98=F98,1,0))+IF(B100=\"\",0,IF(B100=F100,1,0))","v":0},{"$f":"E95+C98+C100","v":20},{"$f":"C95+E98+E100","v":17},{"$f":"O97-P97","v":3},{"$f":"F95+B98+B100","v":5},{"$f":"B95+F98+F100","v":5},{"$f":"R97-S97","v":0},{"$f":"L97*3+N97","v":3}]
[{"$f":"C13","v":"ENGLAND (Veteran)"},{"$f":"'Séries équipes full'!C230","v":3},{"$f":"'Séries équipes full'!D230","v":10},"-",{"$f":"'Séries équipes full'!F230","v":0},{"$f":"'Séries équipes full'!G230","v":0},{"$f":"E13","v":"USA (Veteran)"},"ENGLAND (Veteran)",null,{"$f":"A96","v":"GERMANY (Veteran)"},{"$f":"IF(C96=\"\",0,1)+IF(E97=\"\",0,1)+IF(E100=\"\",0,1)","v":3},{"$f":"IF(B96>F96,1,0)+IF(F97>B97,1,0)+IF(F100>B100,1,0)","v":2},{"$f":"IF(B96<F96,1,0)+IF(F97<B97,1,0)+IF(F100<B100,1,0)","v":1},{"$f":"IF(B96=\"\",0,IF(B96=F96,1,0))+IF(B97=\"\",0,IF(B97=F97,1,0))+IF(B100=\"\",0,IF(B100=F100,1,0))","v":0},{"$f":"C96+E97+E100","v":24},{"$f":"E96+C97+C100","v":19},5,{"$f":"B96+F97+F100","v":5},{"$f":"F96+B97+B100","v":4},1,{"$f":"L98*3+N98","v":6}]
[{"$f":"E13","v":"USA (Veteran)"},{"$f":"'Séries équipes full'!C396","v":0},{"$f":"'Séries équipes full'!D396","v":7},"-",{"$f":"'Séries équipes full'!F396","v":16},{"$f":"'Séries équipes full'!G396","v":3},{"$f":"B13","v":"AUSTRIA (Veteran)"},"USA (Veteran)",null,{"$f":"G96","v":"USA (Veteran)"},{"$f":"IF(E96=\"\",0,1)+IF(E98=\"\",0,1)+IF(C99=\"\",0,1)","v":3},{"$f":"IF(F96>B96,1,0)+IF(F98>B98,1,0)+IF(B99>F99,1,0)","v":0},{"$f":"IF(F96<B96,1,0)+IF(F98<B98,1,0)+IF(B99<F99,1,0)","v":3},{"$f":"IF(B96=\"\",0,IF(B96=F96,1,0))+IF(B98=\"\",0,IF(B98=F98,1,0))+IF(B99=\"\",0,IF(B99=F99,1,0))","v":0},{"$f":"E96+E98+C99","v":11},{"$f":"C96+C98+E99","v":36},-25,{"$f":"F96+F98+B99","v":0},{"$f":"B96+B98+F99","v":9},-9,{"$f":"L99*3+N99","v":0}]
[{"$f":"C13","v":"ENGLAND (Veteran)"},{"$f":"'Séries équipes full'!C403","v":1},{"$f":"'Séries équipes full'!D403","v":5},"-",{"$f":"'Séries équipes full'!F403","v":7},{"$f":"'Séries équipes full'!G403","v":2},{"$f":"D13","v":"GERMANY (Veteran)"},null,null,null,{"$f":"SUM(K96:K99)","v":12},6,6,0,91,91,0,19,19,0]
[]
[]
["Ladies category"]
[]
["Group 1"]
[null,"Team","Ind",null,"Ind","Team"]
[{"$f":"B18","v":"ITALY (Ladies)"},{"$f":"'Séries équipes full'!C237","v":3},{"$f":"'Séries équipes full'!D237","v":19},"-",{"$f":"'Séries équipes full'!F237","v":3},{"$f":"'Séries équipes full'!G237","v":0},{"$f":"C18","v":"GERMANY (Ladies)"},null,null,null,"P","W","L","N","m win","m lose","ind av","+","-","av","PTS"]
[{"$f":"D18","v":"BELGIUM (Ladies)"},{"$f":"'Séries équipes full'!C244","v":3},{"$f":"'Séries équipes full'!D244","v":13},"-",{"$f":"'Séries équipes full'!F244","v":7},{"$f":"'Séries équipes full'!G244","v":1},{"$f":"E18","v":"FRANCE (Ladies)"},"BELGIUM (Ladies)",null,{"$f":"A107","v":"ITALY (Ladies)"},{"$f":"IF(C107=\"\",0,1)+IF(C109=\"\",0,1)+IF(E111=\"\",0,1)","v":3},{"$f":"IF(B107>F107,1,0)+IF(B109>F109,1,0)+IF(F111>B111,1,0)","v":2},{"$f":"IF(B107<F107,1,0)+IF(B109<F109,1,0)+IF(F111<B111,1,0)","v":0},{"$f":"IF(B107=\"\",0,IF(B107=F107,1,0))+IF(B109=\"\",0,IF(B109=F109,1,0))+IF(B111=\"\",0,IF(B111=F111,1,0))","v":1},{"$f":"C107+C109+E111","v":38},{"$f":"E107+E109+C111","v":17},{"$f":"O108-P108","v":21},{"$f":"B107+B109+F111","v":8},{"$f":"F107+F109+B111","v":2},{"$f":"R108-S108","v":6},{"$f":"L108*3+N108","v":7}]
[{"$f":"B18","v":"ITALY (Ladies)"},{"$f":"'Séries équipes full'!C327","v":2},{"$f":"'Séries équipes full'!D327","v":6},"-",{"$f":"'Séries équipes full'!F327","v":9},{"$f":"'Séries équipes full'!G327","v":2},{"$f":"D18","v":"BELGIUM (Ladies)"},"ITALY (Ladies)",null,{"$f":"G107","v":"GERMANY (Ladies)"},{"$f":"IF(E107=\"\",0,1)+IF(C110=\"\",0,1)+IF(C112=\"\",0,1)","v":3},{"$f":"IF(F107>B107,1,0)+IF(B110>F110,1,0)+IF(B112>F112,1,0)","v":0},{"$f":"IF(F107<B107,1,0)+IF(B110<F110,1,0)+IF(B112<F112,1,0)","v":3},{"$f":"IF(B107=\"\",0,IF(B107=F107,1,0))+IF(B110=\"\",0,IF(B110=F110,1,0))+IF(B112=\"\",0,IF(B112=F112,1,0))","v":0},{"$f":"E107+C110+C112","v":8},{"$f":"C107+E110+E112","v":38},{"$f":"O109-P109","v":-30},{"$f":"F107+B110+B112","v":1},{"$f":"B107+F110+F112","v":9},{"$f":"R109-S109","v":-8},{"$f":"L109*3+N109","v":0}]
[{"$f":"C18","v":"GERMANY (Ladies)"},{"$f":"'Séries équipes full'!C334","v":1},{"$f":"'Séries équipes full'!D334","v":3},"-",{"$f":"'Séries équipes full'!F334","v":8},{"$f":"'Séries équipes full'!G334","v":2},{"$f":"E18","v":"FRANCE (Ladies)"},"FRANCE (Ladies)",null,{"$f":"A108","v":"BELGIUM (Ladies)"},{"$f":"IF(C108=\"\",0,1)+IF(E109=\"\",0,1)+IF(E112=\"\",0,1)","v":3},{"$f":"IF(B108>F108,1,0)+IF(F109>B109,1,0)+IF(F112>B112,1,0)","v":2},{"$f":"IF(B108<F108,1,0)+IF(F109<B109,1,0)+IF(F112<B112,1,0)","v":0},{"$f":"IF(B108=\"\",0,IF(B108=F108,1,0))+IF(B109=\"\",0,IF(B109=F109,1,0))+IF(B112=\"\",0,IF(B112=F112,1,0))","v":1},{"$f":"C108+E109+E112","v":33},{"$f":"E108+C109+C112","v":15},18,{"$f":"B108+F109+F112","v":9},{"$f":"F108+B109+B112","v":3},6,{"$f":"L110*3+N110","v":7}]
[{"$f":"E18","v":"FRANCE (Ladies)"},{"$f":"'Séries équipes full'!C514","v":0},{"$f":"'Séries équipes full'!D514","v":5},"-",{"$f":"'Séries équipes full'!F514","v":13},{"$f":"'Séries équipes full'!G514","v":3},{"$f":"B18","v":"ITALY (Ladies)"},"GERMANY (Ladies)",null,{"$f":"G108","v":"FRANCE (Ladies)"},{"$f":"IF(E108=\"\",0,1)+IF(E110=\"\",0,1)+IF(C111=\"\",0,1)","v":3},{"$f":"IF(F108>B108,1,0)+IF(F110>B110,1,0)+IF(B111>F111,1,0)","v":1},{"$f":"IF(F108<B108,1,0)+IF(F110<B110,1,0)+IF(B111<F111,1,0)","v":2},{"$f":"IF(B108=\"\",0,IF(B108=F108,1,0))+IF(B110=\"\",0,IF(B110=F110,1,0))+IF(B111=\"\",0,IF(B111=F111,1,0))","v":0},{"$f":"E108+E110+C111","v":20},{"$f":"C108+C110+E111","v":29},-9,{"$f":"F108+F110+B111","v":3},{"$f":"B108+B110+F111","v":7},-4,{"$f":"L111*3+N111","v":3}]
[{"$f":"C18","v":"GERMANY (Ladies)"},{"$f":"'Séries équipes full'!C521","v":0},{"$f":"'Séries équipes full'!D521","v":2},"-",{"$f":"'Séries équipes full'!F521","v":11},{"$f":"'Séries équipes full'!G521","v":4},{"$f":"D18","v":"BELGIUM (Ladies)"},null,null,null,{"$f":"SUM(K108:K111)","v":12},5,5,2,99,99,0,21,21,0]
[]
[]
["U19 category"]
[]
["Group 1"]
[null,"Team","Ind",null,"Ind","Team"]
[{"$f":"B23","v":"ITALY (U19)"},{"$f":"'Séries équipes full'!C62","v":4},{"$f":"'Séries équipes full'!D62","v":20},{"$f":"'Séries équipes full'!E62","v":"-"},{"$f":"'Séries équipes full'!F62","v":1},{"$f":"'Séries équipes full'!G62","v":0},{"$f":"D23","v":"MALTA (U19)"},null,null,null,"P","W","L","N","m win","m lose","ind av","+","-","av","PTS"]
[{"$f":"D23","v":"MALTA (U19)"},{"$f":"'Séries équipes full'!C251","v":1},{"$f":"'Séries équipes full'!D251","v":5},{"$f":"'Séries équipes full'!E251","v":"-"},{"$f":"'Séries équipes full'!F251","v":12},{"$f":"'Séries équipes full'!G251","v":3},{"$f":"C23","v":"ENGLAND (U19)"},"ITALY (U19)",null,{"$f":"A119","v":"ITALY (U19)"},{"$f":"IF(C119=\"\",0,1)+IF(C121=\"\",0,1)","v":2},{"$f":"IF(B119>F119,1,0)+IF(F121>B121,1,0)","v":2},{"$f":"IF(B119<F119,1,0)+IF(F121<B121,1,0)","v":0},{"$f":"IF(B119=\"\",0,IF(B119=F119,1,0))+IF(B121=\"\",0,IF(B121=F121,1,0))","v":0},{"$f":"B119+F121","v":8},{"$f":"F119+B121","v":0},{"$f":"O120-P120","v":8},{"$f":"B119+F121","v":8},{"$f":"F119+B121","v":0},{"$f":"R120-S120","v":8},{"$f":"L120*3+N120","v":6}]
[{"$f":"C23","v":"ENGLAND (U19)"},{"$f":"'Séries équipes full'!C410","v":0},{"$f":"'Séries équipes full'!D410","v":5},{"$f":"'Séries équipes full'!E410","v":"-"},{"$f":"'Séries équipes full'!F410","v":23},{"$f":"'Séries équipes full'!G410","v":4},{"$f":"B23","v":"ITALY (U19)"},"ENGLAND (U19)",null,{"$f":"G120","v":"ENGLAND (U19)"},{"$f":"IF(E120=\"\",0,1)+IF(C121=\"\",0,1)","v":2},{"$f":"IF(F120>B120,1,0)+IF(B121>F121,1,0)","v":1},{"$f":"IF(F120<B120,1,0)+IF(B121<F121,1,0)","v":1},{"$f":"IF(B120=\"\",0,IF(B120=F120,1,0))+IF(B121=\"\",0,IF(B121=F121,1,0))","v":0},{"$f":"F120+B121","v":3},{"$f":"B120+F121","v":5},{"$f":"O121-P121","v":-2},{"$f":"F120+B121","v":3},{"$f":"B120+F121","v":5},{"$f":"R121-S121","v":-2},{"$f":"L121*3+N121","v":3}]
[null,null,null,null,null,null,null,"MALTA (U19)",null,{"$f":"A120","v":"MALTA (U19)"},{"$f":"IF(C120=\"\",0,1)+IF(E119=\"\",0,1)","v":2},{"$f":"IF(F119>B119,1,0)+IF(B120>F120,1,0)","v":0},{"$f":"IF(F119<B119,1,0)+IF(B120<F120,1,0)","v":2},{"$f":"IF(B119=\"\",0,IF(B119=F119,1,0))+IF(B120=\"\",0,IF(B120=F120,1,0))","v":0},{"$f":"F119+B120","v":1},{"$f":"B119+F120","v":7},-6,{"$f":"F119+B120","v":1},{"$f":"B119+F120","v":7},-6,{"$f":"L122*3+N122","v":0}]
["Group 2",null,null,null,null,null,null,null,null,null,{"$f":"SUM(K119:K122)","v":6},3,3,0,12,12,0,12,12,0]
[null,"Team","Ind",null,"Ind","Team"]
[{"$f":"B24","v":"BELGIUM (U19)"},{"$f":"'Séries équipes full'!C147","v":2},{"$f":"'Séries équipes full'!D147","v":9},"-",{"$f":"'Séries équipes full'!F147","v":5},{"$f":"'Séries équipes full'!G147","v":0},{"$f":"C24","v":"GERMANY (U19)"},null,null,null,"P","W","L","N","m win","m lose","ind av","+","-","av","PTS"]
[{"$f":"D24","v":"PORTUGAL (U19)"},{"$f":"'Séries équipes full'!C154","v":1},{"$f":"'Séries équipes full'!D154","v":4},"-",{"$f":"'Séries équipes full'!F154","v":10},{"$f":"'Séries équipes full'!G154","v":2},{"$f":"E24","v":"FRANCE (U19)"},"BELGIUM (U19)",null,{"$f":"A125","v":"BELGIUM (U19)"},{"$f":"IF(C125=\"\",0,1)+IF(C127=\"\",0,1)+IF(E129=\"\",0,1)","v":3},{"$f":"IF(B125>F125,1,0)+IF(B127>F127,1,0)+IF(F129>B129,1,0)","v":3},{"$f":"IF(B125<F125,1,0)+IF(B127<F127,1,0)+IF(F129<B129,1,0)","v":0},{"$f":"IF(B125=\"\",0,IF(B125=F125,1,0))+IF(B127=\"\",0,IF(B127=F127,1,0))+IF(B129=\"\",0,IF(B129=F129,1,0))","v":0},{"$f":"C125+C127+E129","v":48},{"$f":"E125+E127+C129","v":17},{"$f":"O126-P126","v":31},{"$f":"B125+B127+F129","v":9},{"$f":"F125+F127+B129","v":0},{"$f":"R126-S126","v":9},{"$f":"L126*3+N126","v":9}]
[{"$f":"B24","v":"BELGIUM (U19)"},{"$f":"'Séries équipes full'!C341","v":4},{"$f":"'Séries équipes full'!D341","v":22},"-",{"$f":"'Séries équipes full'!F341","v":4},{"$f":"'Séries équipes full'!G341","v":0},{"$f":"D24","v":"PORTUGAL (U19)"},"GERMANY (U19)",null,{"$f":"G125","v":"GERMANY (U19)"},{"$f":"IF(E125=\"\",0,1)+IF(C128=\"\",0,1)+IF(C130=\"\",0,1)","v":3},{"$f":"IF(F125>B125,1,0)+IF(B128>F128,1,0)+IF(B130>F130,1,0)","v":2},{"$f":"IF(F125<B125,1,0)+IF(B128<F128,1,0)+IF(B130<F130,1,0)","v":1},{"$f":"IF(B125=\"\",0,IF(B125=F125,1,0))+IF(B128=\"\",0,IF(B128=F128,1,0))+IF(B130=\"\",0,IF(B130=F130,1,0))","v":0},{"$f":"E125+C128+C130","v":23},{"$f":"C125+E128+E130","v":19},{"$f":"O127-P127","v":4},{"$f":"F125+B128+B130","v":4},{"$f":"B125+F128+F130","v":4},{"$f":"R127-S127","v":0},{"$f":"L127*3+N127","v":6}]
[{"$f":"C24","v":"GERMANY (U19)"},{"$f":"'Séries équipes full'!C348","v":2},{"$f":"'Séries équipes full'!D348","v":7},"-",{"$f":"'Séries équipes full'!F348","v":4},{"$f":"'Séries équipes full'!G348","v":1},{"$f":"E24","v":"FRANCE (U19)"},"FRANCE (U19)",null,{"$f":"A126","v":"PORTUGAL (U19)"},{"$f":"IF(C126=\"\",0,1)+IF(E127=\"\",0,1)+IF(E130=\"\",0,1)","v":3},{"$f":"IF(B126>F126,1,0)+IF(F127>B127,1,0)+IF(F130>B130,1,0)","v":0},{"$f":"IF(B126<F126,1,0)+IF(F127<B127,1,0)+IF(F130<B130,1,0)","v":3},{"$f":"IF(B126=\"\",0,IF(B126=F126,1,0))+IF(B127=\"\",0,IF(B127=F127,1,0))+IF(B130=\"\",0,IF(B130=F130,1,0))","v":0},{"$f":"C126+E127+E130","v":14},{"$f":"E126+C127+C130","v":43},-29,{"$f":"B126+F127+F130","v":2},{"$f":"F126+B127+B130","v":8},-6,{"$f":"L128*3+N128","v":0}]
[{"$f":"E24","v":"FRANCE (U19)"},{"$f":"'Séries équipes full'!C417","v":0},{"$f":"'Séries équipes full'!D417","v":8},"-",{"$f":"'Séries équipes full'!F417","v":17},{"$f":"'Séries équipes full'!G417","v":3},{"$f":"B24","v":"BELGIUM (U19)"},"PORTUGAL (U19)",null,{"$f":"G126","v":"FRANCE (U19)"},{"$f":"IF(E126=\"\",0,1)+IF(E128=\"\",0,1)+IF(C129=\"\",0,1)","v":3},{"$f":"IF(F126>B126,1,0)+IF(F128>B128,1,0)+IF(B129>F129,1,0)","v":1},{"$f":"IF(F126<B126,1,0)+IF(F128<B128,1,0)+IF(B129<F129,1,0)","v":2},{"$f":"IF(B126=\"\",0,IF(B126=F126,1,0))+IF(B128=\"\",0,IF(B128=F128,1,0))+IF(B129=\"\",0,IF(B129=F129,1,0))","v":0},{"$f":"E126+E128+C129","v":22},{"$f":"C126+C128+E129","v":28},-6,{"$f":"F126+F128+B129","v":3},{"$f":"B126+B128+F129","v":6},-3,{"$f":"L129*3+N129","v":3}]
[{"$f":"C24","v":"GERMANY (U19)"},{"$f":"'Séries équipes full'!C424","v":2},{"$f":"'Séries équipes full'!D424","v":11},"-",{"$f":"'Séries équipes full'!F424","v":6},{"$f":"'Séries équipes full'!G424","v":1},{"$f":"D24","v":"PORTUGAL (U19)"},null,null,null,{"$f":"SUM(K126:K129)","v":12},6,6,0,107,107,0,18,18,0]
[]
[]
["U15 category"]
[]
["Group 1"]
[null,"Team","Ind",null,"Ind","Team"]
[{"$f":"B29","v":"ITALY (U15)"},{"$f":"'Séries équipes full'!C69","v":4},{"$f":"'Séries équipes full'!D69","v":25},"-",{"$f":"'Séries équipes full'!F69","v":3},{"$f":"'Séries équipes full'!G69","v":0},{"$f":"C29","v":"ENGLAND (U15)"},null,null,null,"P","W","L","N","m win","m lose","ind av","+","-","av","PTS"]
[{"$f":"D29","v":"BELGIUM (U15)"},{"$f":"'Séries équipes full'!C76","v":4},{"$f":"'Séries équipes full'!D76","v":17},"-",{"$f":"'Séries équipes full'!F76","v":3},{"$f":"'Séries équipes full'!G76","v":0},{"$f":"E29","v":"SPAIN  (U15)"},"ITALY (U15)",null,{"$f":"A137","v":"ITALY (U15)"},{"$f":"IF(C137=\"\",0,1)+IF(E140=\"\",0,1)+IF(E143=\"\",0,1)+IF(C146=\"\",0,1)+IF(E149=\"\",0,1)","v":5},{"$f":"IF(B137>F137,1,0)+IF(F140>B140,1,0)+IF(F143>B143,1,0)+IF(B146>F146,1,0)+IF(B149>F149,1,0)","v":5},{"$f":"K138-L138-N138","v":0},{"$f":"IF(B137=\"\",0,IF(B137=F137,1,0))+IF(B140=\"\",0,IF(B140=F140,1,0))+IF(B143=\"\",0,IF(B143=F143,1,0))+IF(B146=\"\",0,IF(B146=F146,1,0))+IF(B149=\"\",0,IF(B149=F149,1,0))","v":0},{"$f":"C137+E140+E143+C146+C149","v":107},{"$f":"E137+C140+C143+E146+E149","v":23},{"$f":"O138-P138","v":84},{"$f":"B137+F140+F143+B146+B149","v":18},{"$f":"F137+B140+B143+F146+F149","v":1},{"$f":"R138-S138","v":17},{"$f":"L138*3+N138","v":15}]
[{"$f":"F29","v":"AUSTRIA  (U15)"},{"$f":"'Séries équipes full'!C161","v":4},{"$f":"'Séries équipes full'!D161","v":14},"-",{"$f":"'Séries équipes full'!F161","v":3},{"$f":"'Séries équipes full'!G161","v":0},{"$f":"G29","v":"FRANCE (U15)"},"AUSTRIA  (U15)",null,{"$f":"G137","v":"ENGLAND (U15)"},{"$f":"IF(E137=\"\",0,1)+IF(C141=\"\",0,1)+IF(C144=\"\",0,1)+IF(E147=\"\",0,1)+IF(C150=\"\",0,1)","v":5},{"$f":"IF(F137>B137,1,0)+IF(B141>F141,1,0)+IF(B144>F144,1,0)+IF(F147>B147,1,0)+IF(B150>F149,1,0)","v":1},{"$f":"K139-L139-N139","v":3},{"$f":"IF(B137=\"\",0,IF(B137=F137,1,0))+IF(B141=\"\",0,IF(B141=F141,1,0))+IF(B144=\"\",0,IF(B144=F144,1,0))+IF(B147=\"\",0,IF(B147=F147,1,0))+IF(B150=\"\",0,IF(B150=F150,1,0))","v":1},{"$f":"E137+C141+C144+E147+C150","v":24},{"$f":"C137+E141+E144+C147+E150","v":71},{"$f":"O139-P139","v":-47},{"$f":"F137+B141+B144+F147+B150","v":5},{"$f":"B137+F141+F144+B147+F150","v":14},{"$f":"R139-S139","v":-9},{"$f":"L139*3+N139","v":4}]
[{"$f":"E29","v":"SPAIN  (U15)"},{"$f":"'Séries équipes full'!C168","v":0},{"$f":"'Séries équipes full'!D168","v":2},"-",{"$f":"'Séries équipes full'!F168","v":23},{"$f":"'Séries équipes full'!G168","v":4},{"$f":"B29","v":"ITALY (U15)"},"3c1",null,{"$f":"A138","v":"BELGIUM (U15)"},{"$f":"IF(C138=\"\",0,1)+IF(C142=\"\",0,1)+IF(E144=\"\",0,1)+IF(E146=\"\",0,1)+IF(E151=\"\",0,1)","v":5},{"$f":"IF(B138>F138,1,0)+IF(B142>F142,1,0)+IF(F144>B144,1,0)+IF(F146>B146,1,0)+IF(F151>B151,1,0)","v":3},1,{"$f":"IF(B138=\"\",0,IF(B138=F138,1,0))+IF(B142=\"\",0,IF(B142=F142,1,0))+IF(B144=\"\",0,IF(B144=F144,1,0))+IF(B146=\"\",0,IF(B146=F146,1,0))+IF(B151=\"\",0,IF(B151=F151,1,0))","v":1},{"$f":"C138+C142+E144+E146+E151","v":65},{"$f":"E138+E142+C144+C146+C151","v":38},27,{"$f":"B138+B142+F144+F146+F151","v":13},{"$f":"F138+F142+B144+B146+B151","v":5},8,{"$f":"L140*3+N140","v":10}]
[{"$f":"C29","v":"ENGLAND (U15)"},{"$f":"'Séries équipes full'!C258","v":2},{"$f":"'Séries équipes full'!D258","v":7},"-",{"$f":"'Séries équipes full'!F258","v":7},{"$f":"'Séries équipes full'!G258","v":2},{"$f":"G29","v":"FRANCE (U15)"},"4c1",null,{"$f":"G138","v":"SPAIN  (U15)"},{"$f":"IF(E138=\"\",0,1)+IF(C140=\"\",0,1)+IF(E145=\"\",0,1)+IF(C148=\"\",0,1)+IF(E150=\"\",0,1)","v":5},{"$f":"IF(F138>B138,1,0)+IF(B140>F140,1,0)+IF(F145>B145,1,0)+IF(B148>F148,1,0)+IF(F150>B150,1,0)","v":0},5,{"$f":"IF(B138=\"\",0,IF(B138=F138,1,0))+IF(B140=\"\",0,IF(B140=F140,1,0))+IF(B145=\"\",0,IF(B145=F145,1,0))+IF(B148=\"\",0,IF(B148=F148,1,0))+IF(B150=\"\",0,IF(B150=F150,1,0))","v":0},{"$f":"E138+C140+E145+C148+E150","v":20},{"$f":"C138+E140+C145+E148+C150","v":74},-54,{"$f":"F138+B140+F145+B148+F150","v":3},{"$f":"B138+F140+B145+F148+B150","v":16},-13,{"$f":"L141*3+N141","v":0}]
[{"$f":"D29","v":"BELGIUM (U15)"},{"$f":"'Séries équipes full'!C265","v":2},{"$f":"'Séries équipes full'!D265","v":9},"-",{"$f":"'Séries équipes full'!F265","v":7},{"$f":"'Séries équipes full'!G265","v":2},{"$f":"F29","v":"AUSTRIA  (U15)"},"5c1",null,{"$f":"A139","v":"AUSTRIA  (U15)"},{"$f":"IF(C139=\"\",0,1)+IF(E142=\"\",0,1)+IF(C145=\"\",0,1)+IF(C147=\"\",0,1)+IF(E149=\"\",0,1)","v":5},{"$f":"IF(B139>F139,1,0)+IF(F142>B142,1,0)+IF(B145>F145,1,0)+IF(B147>F147,1,0)+IF(F149>B149,1,0)","v":3},1,{"$f":"IF(B139=\"\",0,IF(B139=F139,1,0))+IF(B142=\"\",0,IF(B142=F142,1,0))+IF(B145=\"\",0,IF(B145=F145,1,0))+IF(B147=\"\",0,IF(B147=F147,1,0))+IF(B149=\"\",0,IF(B149=F149,1,0))","v":1},{"$f":"C139+E142+C145+C147+E149","v":66},{"$f":"E139+C142+E145+E147+C149","v":33},33,{"$f":"B139+F142+B145+B147+F149","v":14},{"$f":"F139+B142+F145+F147+B149","v":6},8,{"$f":"L142*3+N142","v":10}]
[{"$f":"G29","v":"FRANCE (U15)"},{"$f":"'Séries équipes full'!C355","v":0},{"$f":"'Séries équipes full'!D355","v":2},"-",{"$f":"'Séries équipes full'!F355","v":19},{"$f":"'Séries équipes full'!G355","v":4},{"$f":"B29","v":"ITALY (U15)"},"6c1",null,{"$f":"G139","v":"FRANCE (U15)"},{"$f":"IF(E139=\"\",0,1)+IF(E141=\"\",0,1)+IF(C143=\"\",0,1)+IF(E148=\"\",0,1)+IF(C151=\"\",0,1)","v":5},{"$f":"IF(F139>B139,1,0)+IF(F141>B141,1,0)+IF(B143>F143,1,0)+IF(F148>B148,1,0)+IF(B151>F151,1,0)","v":1},3,{"$f":"IF(B139=\"\",0,IF(B139=F139,1,0))+IF(B141=\"\",0,IF(B141=F141,1,0))+IF(B143=\"\",0,IF(B143=F143,1,0))+IF(B148=\"\",0,IF(B148=F148,1,0))+IF(B151=\"\",0,IF(B151=F151,1,0))","v":1},{"$f":"E139+E141+C143+E148+C151","v":19},{"$f":"C139+C141+E143+C148+E151","v":62},-43,{"$f":"F139+F141+B143+F148+B151","v":4},{"$f":"B139+B141+F143+B148+F151","v":15},-11,4]
[{"$f":"C29","v":"ENGLAND (U15)"},{"$f":"'Séries équipes full'!C362","v":0},{"$f":"'Séries équipes full'!D362","v":3},"-",{"$f":"'Séries équipes full'!F362","v":19},{"$f":"'Séries équipes full'!G362","v":3},{"$f":"D29","v":"BELGIUM (U15)"},null,null,null,{"$f":"SUM(K138:K143)","v":30},{"$f":"SUM(L138:L143)","v":13},{"$f":"SUM(M138:M143)","v":13},4,{"$f":"SUM(O138:O143)","v":301},{"$f":"SUM(P138:P143)","v":301},{"$f":"SUM(Q138:Q143)","v":0},{"$f":"SUM(R138:R143)","v":57},{"$f":"SUM(S138:S143)","v":57},{"$f":"SUM(T138:T143)","v":0}]
[{"$f":"F29","v":"AUSTRIA  (U15)"},{"$f":"'Séries équipes full'!C431","v":3},{"$f":"'Séries équipes full'!D431","v":19},"-",{"$f":"'Séries équipes full'!F431","v":3},{"$f":"'Séries équipes full'!G431","v":1},{"$f":"E29","v":"SPAIN  (U15)"}]
[{"$f":"B29","v":"ITALY (U15)"},{"$f":"'Séries équipes full'!C438","v":3},{"$f":"'Séries équipes full'!D438","v":23},"-",{"$f":"'Séries équipes full'!F438","v":5},{"$f":"'Séries équipes full'!G438","v":0},{"$f":"D29","v":"BELGIUM (U15)"}]
[{"$f":"F29","v":"AUSTRIA  (U15)"},{"$f":"'Séries équipes full'!C528","v":4},{"$f":"'Séries équipes full'!D528","v":15},"-",{"$f":"'Séries équipes full'!F528","v":1},{"$f":"'Séries équipes full'!G528","v":0},{"$f":"C29","v":"ENGLAND (U15)"}]
[{"$f":"E29","v":"SPAIN  (U15)"},{"$f":"'Séries équipes full'!C535","v":1},{"$f":"'Séries équipes full'!D535","v":7},"-",{"$f":"'Séries équipes full'!F535","v":5},{"$f":"'Séries équipes full'!G535","v":2},{"$f":"G29","v":"FRANCE (U15)"}]
[{"$f":"B29","v":"ITALY (U15)"},{"$f":"'Séries équipes full'!C614","v":3},{"$f":"'Séries équipes full'!D614","v":17},"-",{"$f":"'Séries équipes full'!F614","v":11},{"$f":"'Séries équipes full'!G614","v":1},{"$f":"F29","v":"AUSTRIA  (U15)"}]
[{"$f":"C29","v":"ENGLAND (U15)"},{"$f":"'Séries équipes full'!C621","v":3},{"$f":"'Séries équipes full'!D621","v":10},"-",{"$f":"'Séries équipes full'!F621","v":5},{"$f":"'Séries équipes full'!G621","v":1},{"$f":"E29","v":"SPAIN  (U15)"}]
[{"$f":"G29","v":"FRANCE (U15)"},{"$f":"'Séries équipes full'!C628","v":0},{"$f":"'Séries équipes full'!D628","v":2},"-",{"$f":"'Séries équipes full'!F628","v":15},{"$f":"'Séries équipes full'!G628","v":4},{"$f":"D29","v":"BELGIUM (U15)"}]
[]
[]
["U12 category"]
[]
["Group 1"]
[null,"Team","Ind",null,"Ind","Team"]
[{"$f":"B34","v":"ITALY (U12)"},{"$f":"'Séries équipes full'!C445","v":4},{"$f":"'Séries équipes full'!D445","v":15},"-",{"$f":"'Séries équipes full'!F445","v":1},{"$f":"'Séries équipes full'!G445","v":0},{"$f":"C34","v":"FRANCE (U12)"},null,null,null,"P","W","L","N","m win","m lose","ind av","+","-","av","PTS"]
[{"$f":"D34","v":"SPAIN  (U12)"},{"$f":"'Séries équipes full'!C452","v":1},{"$f":"'Séries équipes full'!D452","v":9},"-",{"$f":"'Séries équipes full'!F452","v":7},{"$f":"'Séries équipes full'!G452","v":2},{"$f":"E34","v":"BELGIUM (U12)"},"ITALY (U12)",null,{"$f":"A158","v":"ITALY (U12)"},{"$f":"IF(C158=\"\",0,1)+IF(C160=\"\",0,1)+IF(E162=\"\",0,1)","v":3},{"$f":"IF(B158>F158,1,0)+IF(B160>F160,1,0)+IF(F162>B162,1,0)","v":3},{"$f":"IF(B158<F158,1,0)+IF(B160<F160,1,0)+IF(F162<B162,1,0)","v":0},{"$f":"IF(B158=\"\",0,IF(B158=F158,1,0))+IF(B160=\"\",0,IF(B160=F160,1,0))+IF(B162=\"\",0,IF(B162=F162,1,0))","v":0},{"$f":"C158+C160+E162","v":44},{"$f":"E158+E160+C162","v":6},{"$f":"O159-P159","v":38},{"$f":"B158+B160+F162","v":10},{"$f":"F158+F160+B162","v":1},{"$f":"R159-S159","v":9},{"$f":"L159*3+N159","v":9}]
[{"$f":"B34","v":"ITALY (U12)"},{"$f":"'Séries équipes full'!C542","v":2},{"$f":"'Séries équipes full'!D542","v":7},"-",{"$f":"'Séries équipes full'!F542","v":4},{"$f":"'Séries équipes full'!G542","v":1},{"$f":"D34","v":"SPAIN  (U12)"},"BELGIUM (U12)",null,{"$f":"G158","v":"FRANCE (U12)"},{"$f":"IF(E158=\"\",0,1)+IF(C161=\"\",0,1)+IF(C163=\"\",0,1)","v":3},{"$f":"IF(F158>B158,1,0)+IF(B161>F161,1,0)+IF(B163>F163,1,0)","v":0},{"$f":"IF(F158<B158,1,0)+IF(B161<F161,1,0)+IF(B163<F163,1,0)","v":2},{"$f":"IF(B158=\"\",0,IF(B158=F158,1,0))+IF(B161=\"\",0,IF(B161=F161,1,0))+IF(B163=\"\",0,IF(B163=F163,1,0))","v":1},{"$f":"E158+C161+C163","v":14},{"$f":"C158+E161+E163","v":33},{"$f":"O160-P160","v":-19},{"$f":"F158+B161+B163","v":3},{"$f":"B158+F161+F163","v":9},{"$f":"R160-S160","v":-6},{"$f":"L160*3+N160","v":1}]
[{"$f":"C34","v":"FRANCE (U12)"},{"$f":"'Séries équipes full'!C549","v":1},{"$f":"'Séries équipes full'!D549","v":5},"-",{"$f":"'Séries équipes full'!F549","v":11},{"$f":"'Séries équipes full'!G549","v":3},{"$f":"E34","v":"BELGIUM (U12)"},"SPAIN  (U12)",null,{"$f":"A159","v":"SPAIN  (U12)"},{"$f":"IF(C159=\"\",0,1)+IF(E160=\"\",0,1)+IF(E163=\"\",0,1)","v":3},{"$f":"IF(B159>F159,1,0)+IF(F160>B160,1,0)+IF(F163>B163,1,0)","v":0},{"$f":"IF(B159<F159,1,0)+IF(F160<B160,1,0)+IF(F163<B163,1,0)","v":2},{"$f":"IF(B159=\"\",0,IF(B159=F159,1,0))+IF(B160=\"\",0,IF(B160=F160,1,0))+IF(B163=\"\",0,IF(B163=F163,1,0))","v":1},{"$f":"C159+E160+E163","v":20},{"$f":"E159+C160+C163","v":22},-2,{"$f":"B159+F160+F163","v":4},{"$f":"F159+B160+B163","v":6},-2,{"$f":"L161*3+N161","v":1}]
[{"$f":"E34","v":"BELGIUM (U12)"},{"$f":"'Séries équipes full'!C635","v":0},{"$f":"'Séries équipes full'!D635","v":1},"-",{"$f":"'Séries équipes full'!F635","v":22},{"$f":"'Séries équipes full'!G635","v":4},{"$f":"B34","v":"ITALY (U12)"},"FRANCE (U12)",null,{"$f":"G159","v":"BELGIUM (U12)"},{"$f":"IF(E159=\"\",0,1)+IF(E161=\"\",0,1)+IF(C162=\"\",0,1)","v":3},{"$f":"IF(F159>B159,1,0)+IF(F161>B161,1,0)+IF(B162>F162,1,0)","v":2},{"$f":"IF(F159<B159,1,0)+IF(F161<B161,1,0)+IF(B162<F162,1,0)","v":1},{"$f":"IF(B159=\"\",0,IF(B159=F159,1,0))+IF(B161=\"\",0,IF(B161=F161,1,0))+IF(B162=\"\",0,IF(B162=F162,1,0))","v":0},{"$f":"E159+E161+C162","v":19},{"$f":"C159+C161+E162","v":36},-17,{"$f":"F159+F161+B162","v":5},{"$f":"B159+B161+F162","v":6},-1,{"$f":"L162*3+N162","v":6}]
[{"$f":"C34","v":"FRANCE (U12)"},{"$f":"'Séries équipes full'!C642","v":2},{"$f":"'Séries équipes full'!D642","v":8},"-",{"$f":"'Séries équipes full'!F642","v":7},{"$f":"'Séries équipes full'!G642","v":2},{"$f":"D34","v":"SPAIN  (U12)"},null,null,null,{"$f":"SUM(K159:K162)","v":12},5,5,2,97,97,0,22,22,0]

{"sheet":"Séries équipes full","index":3,"n_rows":714,"n_cols":12,"rows_kept":714,"cut":false,"hidden":false,"merged":[]}
["Série 1 - 9h00"]
[]
["Tables"]
[null,null,null,null,null,null,null,null,null,"Referees"]
[]
["1 à 4",{"$f":"'Team Groups'!B4","v":"AUSTRIA (Open)"},{"$f":"IF(D7>F7,1,0)+IF(D8>F8,1,0)+IF(D9>F9,1,0)+IF(D10>F10,1,0)","v":4},{"$f":"SUM(D7:D11)","v":26},"-",{"$f":"SUM(F7:F11)","v":2},{"$f":"IF(D7<F7,1,0)+IF(D8<F8,1,0)+IF(D9<F9,1,0)+IF(D10<F10,1,0)","v":0},{"$f":"'Team Groups'!C4","v":"SCOTLAND (Open)"},null,{"$f":"'Team Groups'!D6","v":"PORTUGAL (Open)"}]
[1,"Wolfgang Haas",null,11,"-",0,null,"Rob Conway"]
[2,"Christian Haas",null,6,"-",0,null,"Malcolm Lees"]
[3,"Heinz Eder",null,4,"-",1,null,"Andy Beskaby"]
[4,"Wolfgang Leitner",null,5,"-",1,null,"Gareth Christie"]
["Sub","Alexander Haas"]
[]
["5 à 8",{"$f":"'Team Groups'!D4","v":"GREECE (Open)"},{"$f":"IF(D14>F14,1,0)+IF(D15>F15,1,0)+IF(D16>F16,1,0)+IF(D17>F17,1,0)","v":4},{"$f":"SUM(D14:D18)","v":19},"-",{"$f":"SUM(F14:F18)","v":1},{"$f":"IF(D14<F14,1,0)+IF(D15<F15,1,0)+IF(D16<F16,1,0)+IF(D17<F17,1,0)","v":0},{"$f":"'Team Groups'!E4","v":"RUSSIA (Open)"},null,{"$f":"'Team Groups'!B6","v":"BELGIUM (Open)"}]
[5,"Spyros Patrinos",null,8,"-",0,null,"Dmitry Lavrentcov"]
[6,"Kostas Stamokostas",null,4,"-",1,null,"Aton Volkov"]
[7,"Kostas Seses",null,3,"-",0,null,"Andrey Kudryashov"]
[8,"Lazaros Papakonstantinou",null,4,"-",0,null,"Maksim Gulyev"]
["Sub","Velissarios Fragakis"]
[]
["9 à 12",{"$f":"'Team Groups'!B5","v":"ITALY (Open)"},{"$f":"IF(D21>F21,1,0)+IF(D22>F22,1,0)+IF(D23>F23,1,0)+IF(D24>F24,1,0)","v":4},{"$f":"SUM(D21:D25)","v":43},"-",{"$f":"SUM(F21:F25)","v":0},{"$f":"IF(D21<F21,1,0)+IF(D22<F22,1,0)+IF(D23<F23,1,0)+IF(D24<F24,1,0)","v":0},{"$f":"'Team Groups'!C5","v":"JAPAN (Open)"},null,{"$f":"'Team Groups'!C6","v":"FRANCE (Open)"}]
[9,"Saverio Bari",null,16,"-",0,null,"Suguru Fujino"]
[10,"Massimiliano Nastasi",null,10,"-",0,null,"Hideaki Wada"]
[11,"Daniele Bertelli",null,14,"-",0,null,"Koshiro Shibata"]
[12,"Luca Colangelo",null,3,"-",0]
["Sub","Luca Zambello"]
[]
["13 à 16",{"$f":"'Team Groups'!D5","v":"NETHERLAND (Open)"},{"$f":"IF(D28>F28,1,0)+IF(D29>F29,1,0)+IF(D30>F30,1,0)+IF(D31>F31,1,0)","v":3},{"$f":"SUM(D28:D32)","v":18},"-",{"$f":"SUM(F28:F32)","v":6},{"$f":"IF(D28<F28,1,0)+IF(D29<F29,1,0)+IF(D30<F30,1,0)+IF(D31<F31,1,0)","v":0},{"$f":"'Team Groups'!E5","v":"ENGLAND (Open)"},null,{"$f":"'Team Groups'!E6","v":"GILBRALTAR (Open)"}]
[13,"Kenney Gerrets",null,3,"-",3,null,"Luca Martinelli"]
[14,"Patrick de Jong",null,4,"-",0,null,"Brett Price"]
[15,"Henk Landzaat",null,3,"-",1,null,"Matthew Atkin"]
[16,"Maikel de Haas",null,8,"-",2,null,"Luca Martinelli"]
["Sub"]
[]
["17 à 20",{"$f":"'Team Groups'!B12","v":"ITALY (Veteran)"},{"$f":"IF(D35>F35,1,0)+IF(D36>F36,1,0)+IF(D37>F37,1,0)+IF(D38>F38,1,0)","v":2},{"$f":"SUM(D35:D39)","v":8},"-",{"$f":"SUM(F35:F39)","v":3},{"$f":"IF(D35<F35,1,0)+IF(D36<F36,1,0)+IF(D37<F37,1,0)+IF(D38<F38,1,0)","v":0},{"$f":"'Team Groups'!C12","v":"GREECE (Veteran)"},null,{"$f":"'Team Groups'!B3","v":"SPAIN (Open)"}]
[17,"Stefano De Francesco",null,4,"-",0,null,"Dimitris Stamatopoulos"]
[18,"Francesco Mattiangeli",null,2,"-",2,null,"Chris Aggelinas"]
[19,"Mario Corradi",null,1,"-",0,null,"Nikos Naskos"]
[20,"Massimiliano Croatti",null,1,"-",1,null,"Panagiotis Haratsis"]
["Sub","Gianfranco Calonico",null,null,null,null,null,"Giorgos Aggelinas"]
[]
["21 à 24",{"$f":"'Team Groups'!D12","v":"GILBRALTAR (Veteran)"},{"$f":"IF(D42>F42,1,0)+IF(D43>F43,1,0)+IF(D44>F44,1,0)+IF(D45>F45,1,0)","v":1},{"$f":"SUM(D42:D46)","v":5},"-",{"$f":"SUM(F42:F46)","v":3},{"$f":"IF(D42<F42,1,0)+IF(D43<F43,1,0)+IF(D44<F44,1,0)+IF(D45<F45,1,0)","v":1},{"$f":"'Team Groups'!E12","v":"MALTA (Veteran)"},null,{"$f":"'Team Groups'!D3","v":"USA (Open)"}]
[21,"Jose Luis Bonavia",null,0,"-",1,null,"Massimo Cremona"]
[22,"Guy Palmer",null,0,"-",0,null,"Jason Pisani"]
[23,"Patrick Dean",null,2,"-",2,null,"Charles Aquilina"]
[24,"John Field",null,3,"-",0,null,"John Zammit"]
["Sub"]
[]
["25 à 28",{"$f":"'Team Groups'!B13","v":"AUSTRIA (Veteran)"},{"$f":"IF(D49>F49,1,0)+IF(D50>F50,1,0)+IF(D51>F51,1,0)+IF(D52>F52,1,0)","v":3},{"$f":"SUM(D49:D53)","v":10},"-",{"$f":"SUM(F49:F53)","v":5},{"$f":"IF(D49<F49,1,0)+IF(D50<F50,1,0)+IF(D51<F51,1,0)+IF(D52<F52,1,0)","v":1},{"$f":"'Team Groups'!C13","v":"ENGLAND (Veteran)"},null,{"$f":"'Team Groups'!C3","v":"GERMANY (Open)"}]
[25,"Günther Bamberzky",null,1,"-",0,null,"Jeremy Bradley"]
[26,"Manfred Pawlica",null,3,"-",1,null,"Brian Daley"]
[27,"David Busch",null,4,"-",1,null,"Phil Redman"]
[28,"Erich Hinkelmann",null,2,"-",3,null,"Justin Finch"]
["Sub","Karl-Heinz Haider"]
[]
["29 à 32",{"$f":"'Team Groups'!D13","v":"GERMANY (Veteran)"},{"$f":"IF(D56>F56,1,0)+IF(D57>F57,1,0)+IF(D58>F58,1,0)+IF(D59>F59,1,0)","v":3},{"$f":"SUM(D56:D60)","v":10},"-",{"$f":"SUM(F56:F60)","v":4},{"$f":"IF(D56<F56,1,0)+IF(D57<F57,1,0)+IF(D58<F58,1,0)+IF(D59<F59,1,0)","v":0},{"$f":"'Team Groups'!E13","v":"USA (Veteran)"},null,{"$f":"'Team Groups'!B11","v":"SPAIN (Veteran)"}]
[29,"Frank Hagenkötter",null,2,"-",0,null,"Paul O'Donovan Rossa"]
[30,"Rainer Vogt",null,3,"-",0,null,"Dario Passadore"]
[31,"Arnold Mair",null,2,"-",2,null,"Gregg Deinhart"]
[32,"Frank Stiller",null,3,"-",2,null,"Paul Eyes"]
["Sub"]
[]
["33 à 36",{"$f":"'Team Groups'!B23","v":"ITALY (U19)"},{"$f":"IF(D63>F63,1,0)+IF(D64>F64,1,0)+IF(D65>F65,1,0)+IF(D66>F66,1,0)","v":4},{"$f":"SUM(D63:D67)","v":20},"-",{"$f":"SUM(F63:F67)","v":1},{"$f":"IF(D63<F63,1,0)+IF(D64<F64,1,0)+IF(D65<F65,1,0)+IF(D66<F66,1,0)","v":0},{"$f":"'Team Groups'!D23","v":"MALTA (U19)"},null,{"$f":"'Team Groups'!D11","v":"BELGIUM (Veteran)"}]
[33,"Paolo Zambello",null,5,"-",0,null,"Joseph Agius"]
[34,"Andrea Ciccarelli",null,2,"-",0,null,"Jurgen Balzan"]
[35,"Nicola Borgo",null,10,"-",1,null,"Nealmark Bonnici"]
[36,"Marco Di Vito",null,3,"-",0,"ff"]
["Sub","Matteo Ciccarelli"]
[]
["37 à 40",{"$f":"'Team Groups'!B29","v":"ITALY (U15)"},{"$f":"IF(D70>F70,1,0)+IF(D71>F71,1,0)+IF(D72>F72,1,0)+IF(D73>F73,1,0)","v":4},{"$f":"SUM(D70:D74)","v":25},"-",{"$f":"SUM(F70:F74)","v":3},{"$f":"IF(D70<F70,1,0)+IF(D71<F71,1,0)+IF(D72<F72,1,0)+IF(D73<F73,1,0)","v":0},{"$f":"'Team Groups'!C29","v":"ENGLAND (U15)"},null,{"$f":"'Team Groups'!C11","v":"FRANCE (Veteran)"}]
[37,"Riccardo Lazzari",null,2,"-",0,null,"Thomas Price"]
[38,"Antonio La Torre",null,10,"-",0,null,"Conor Atkin"]
[39,"Andrea Bolognino",null,7,"-",2,null,"Rhys Williams"]
[40,"Matteo Brillantino",null,6,"-",1,null,"Joshua Foreman"]
["Sub","Leonardo Giudice"]
[]
["41 à 44",{"$f":"'Team Groups'!D29","v":"BELGIUM (U15)"},{"$f":"IF(D77>F77,1,0)+IF(D78>F78,1,0)+IF(D79>F79,1,0)+IF(D80>F80,1,0)","v":4},{"$f":"SUM(D77:D81)","v":17},"-",{"$f":"SUM(F77:F81)","v":3},{"$f":"IF(D77<F77,1,0)+IF(D78<F78,1,0)+IF(D79<F79,1,0)+IF(D80<F80,1,0)","v":0},{"$f":"'Team Groups'!E29","v":"SPAIN  (U15)"},null,{"$f":"'Team Groups'!D24","v":"PORTUGAL (U19)"}]
[41,"Maxime Rairoux",null,2,"-",1,null,"Antonio Garcia Fernandez"]
[42,"Corentin Bouchez",null,9,"-",1,null,"Jorge Pinero"]
[43,"Noé Scheen",null,3,"-",1,null,"Gonzalo Garcia- Guereta"]
[44,"Louison Giaux",null,3,"-",0,"ff"]
["Sub"]
[]
["45 à 48"]
[]
[]
["Série 2 - 10h00"]
[]
["Tables"]
[null,null,null,null,null,null,null,null,null,"Referees"]
[]
["1 à 4",{"$f":"'Team Groups'!B3","v":"SPAIN (Open)"},{"$f":"IF(D92>F92,1,0)+IF(D93>F93,1,0)+IF(D94>F94,1,0)+IF(D95>F95,1,0)","v":2},{"$f":"SUM(D92:D96)","v":18},"-",{"$f":"SUM(F92:F96)","v":12},{"$f":"IF(D92<F92,1,0)+IF(D93<F93,1,0)+IF(D94<F94,1,0)+IF(D95<F95,1,0)","v":2},{"$f":"'Team Groups'!D3","v":"USA (Open)"},null,{"$f":"'Team Groups'!D5","v":"NETHERLAND (Open)"}]
[1,"Antonio Casin",null,2,"-",5,null,"Daniel Cranston"]
[2,"David Gonzalez",null,6,"-",1,null,"Patrick Sheridan"]
[3,"Juan Manuel Noguera",null,10,"-",0,null,"Mike Tillman"]
[4,"José David Somoza",null,0,"-",6,null,"Christian Filippella"]
["Sub"]
[]
["5 à 8",{"$f":"'Team Groups'!B6","v":"BELGIUM (Open)"},{"$f":"IF(D99>F99,1,0)+IF(D100>F100,1,0)+IF(D101>F101,1,0)+IF(D102>F102,1,0)","v":3},{"$f":"SUM(D99:D103)","v":7},"-",{"$f":"SUM(F99:F103)","v":3},{"$f":"IF(D99<F99,1,0)+IF(D100<F100,1,0)+IF(D101<F101,1,0)+IF(D102<F102,1,0)","v":1},{"$f":"'Team Groups'!C6","v":"FRANCE (Open)"},null,{"$f":"'Team Groups'!B5","v":"ITALY (Open)"}]
[5,"Valéry Dejardin",null,1,"-",2,null,"Jean-Guillaume Einsle"]
[6,"Rémy Huynh",null,2,"-",1,null,"Fayçal Rouis"]
[7,"Christophe Dheur",null,2,"-",0,null,"Romain Lafontaine"]
[8,"Sébastien Scheen",null,2,"-",0,null,"Jean-Marie Amberny"]
["Sub","Bessim Golger",null,null,null,null,null,"Rémi Soret"]
[]
["9 à 12",{"$f":"'Team Groups'!D6","v":"PORTUGAL (Open)"},{"$f":"IF(D106>F106,1,0)+IF(D107>F107,1,0)+IF(D108>F108,1,0)+IF(D109>F109,1,0)","v":2},{"$f":"SUM(D106:D110)","v":19},"-",{"$f":"SUM(F106:F110)","v":6},{"$f":"IF(D106<F106,1,0)+IF(D107<F107,1,0)+IF(D108<F108,1,0)+IF(D109<F109,1,0)","v":1},{"$f":"'Team Groups'!E6","v":"GILBRALTAR (Open)"},null,{"$f":"'Team Groups'!C5","v":"JAPAN (Open)"}]
[9,"Diogo Pereira",null,1,"-",1,null,"Niall Dean"]
[10,"Luis Abreu",null,8,"-",2,null,"Francis Avellano"]
[11,"Sergio Ramos",null,9,"-",1,null,"Jonathan Dotto"]
[12,"Nuno Henriques",null,1,"-",2,null,"Lawrence Alvarez"]
["Sub"]
[]
["13 à 16",{"$f":"'Team Groups'!B4","v":"AUSTRIA (Open)"},{"$f":"IF(D113>F113,1,0)+IF(D114>F114,1,0)+IF(D115>F115,1,0)+IF(D116>F116,1,0)","v":3},{"$f":"SUM(D113:D117)","v":6},"-",{"$f":"SUM(F113:F117)","v":4},{"$f":"IF(D113<F113,1,0)+IF(D114<F114,1,0)+IF(D115<F115,1,0)+IF(D116<F116,1,0)","v":1},{"$f":"'Team Groups'!D4","v":"GREECE (Open)"},null,{"$f":"'Team Groups'!E5","v":"ENGLAND (Open)"}]
[13,"Heinz Eder",null,2,"-",1,null,"Lazaros Papakonstantinou"]
[14,"Wolfgang Leitner",null,2,"-",1,null,"Spyros Hantzaras"]
[15,"Christian Haas",null,2,"-",1,null,"Spyros Patrinos"]
[16,"Alexander Haas",null,0,"-",1,null,"Giorgos Koutis"]
["Sub","Wolfgang Haas",null,null,null,null,null,"Velissarios Fragakis"]
[]
["17 à 20",{"$f":"'Team Groups'!C4","v":"SCOTLAND (Open)"},{"$f":"IF(D120>F120,1,0)+IF(D121>F121,1,0)+IF(D122>F122,1,0)+IF(D123>F123,1,0)","v":4},{"$f":"SUM(D120:D124)","v":25},"-",{"$f":"SUM(F120:F124)","v":4},{"$f":"IF(D120<F120,1,0)+IF(D121<F121,1,0)+IF(D122<F122,1,0)+IF(D123<F123,1,0)","v":0},{"$f":"'Team Groups'!E4","v":"RUSSIA (Open)"},null,{"$f":"'Team Groups'!D13","v":"GERMANY (Veteran)"}]
[17,"Malcolm Lees",null,8,"-",4,null,"Dmitry Lavrentcov"]
[18,"Andy Beskaby",null,6,"-",0,null,"Aton Volkov"]
[19,"Gareth Christie",null,4,"-",0,null,"Andrey Kudryashov"]
[20,"Rob Conway",null,7,"-",0,null,"Maksim Gulyev"]
["Sub"]
[]
["21 à 24",{"$f":"'Team Groups'!B11","v":"SPAIN (Veteran)"},{"$f":"IF(D127>F127,1,0)+IF(D128>F128,1,0)+IF(D129>F129,1,0)+IF(D130>F130,1,0)","v":1},{"$f":"SUM(D127:D131)","v":3},"-",{"$f":"SUM(F127:F131)","v":8},{"$f":"IF(D127<F127,1,0)+IF(D128<F128,1,0)+IF(D129<F129,1,0)+IF(D130<F130,1,0)","v":3},{"$f":"'Team Groups'!D11","v":"BELGIUM (Veteran)"},null,{"$f":"'Team Groups'!B13","v":"AUSTRIA (Veteran)"}]
[21,"Antonio Montano",null,1,"-",2,null,"Eric  Threis"]
[22,"Vicenç Prats Salat",null,2,"-",1,null,"Alain Jadot"]
[23,"Juan Carlos Granados",null,0,"-",3,null,"Pascal Scheen"]
[24,"Ferran Coll",null,0,"-",2,null,"Benoît Massart"]
["Sub","Luis Lopez ",null,null,null,null,null,"Daniel Scheen"]
[]
["25 à 28",{"$f":"'Team Groups'!B12","v":"ITALY (Veteran)"},{"$f":"IF(D134>F134,1,0)+IF(D135>F135,1,0)+IF(D136>F136,1,0)+IF(D137>F137,1,0)","v":3},{"$f":"SUM(D134:D138)","v":9},"-",{"$f":"SUM(F134:F138)","v":1},{"$f":"IF(D134<F134,1,0)+IF(D135<F135,1,0)+IF(D136<F136,1,0)+IF(D137<F137,1,0)","v":0},{"$f":"'Team Groups'!D12","v":"GILBRALTAR (Veteran)"},null,{"$f":"'Team Groups'!E13","v":"USA (Veteran)"}]
[25,"Gianfranco Calonico",null,3,"-",1,null,"Patrick Dean"]
[26,"Francesco Mattiangeli",null,2,"-",0,null,"Guy Palmer"]
[27,"Patrizio Lazzaretti",null,0,"-",0,null,"John Field"]
[28,"Mario Corradi",null,4,"-",0,null,"Jose Luis Bonavia"]
["Sub","Massimiliano Croatti"]
[]
["29 à 32",{"$f":"'Team Groups'!C12","v":"GREECE (Veteran)"},{"$f":"IF(D141>F141,1,0)+IF(D142>F142,1,0)+IF(D143>F143,1,0)+IF(D144>F144,1,0)","v":2},{"$f":"SUM(D141:D145)","v":6},"-",{"$f":"SUM(F141:F145)","v":6},{"$f":"IF(D141<F141,1,0)+IF(D142<F142,1,0)+IF(D143<F143,1,0)+IF(D144<F144,1,0)","v":2},{"$f":"'Team Groups'!E12","v":"MALTA (Veteran)"},null,{"$f":"'Team Groups'!C13","v":"ENGLAND (Veteran)"}]
[29,"Panagiotis Haratsis",null,0,"-",3,null,"Charles Aquilina"]
[30,"Nikos Naskos",null,1,"-",2,null,"Massimo Cremona"]
[31,"Dimitris Stamatopoulos",null,3,"-",0,null,"John Zammit"]
[32,"Chris Aggelinas",null,2,"-",1,null,"Jason Pisani"]
["Sub"]
[]
["33 à 36",{"$f":"'Team Groups'!B24","v":"BELGIUM (U19)"},{"$f":"IF(D148>F148,1,0)+IF(D149>F149,1,0)+IF(D150>F150,1,0)+IF(D151>F151,1,0)","v":2},{"$f":"SUM(D148:D152)","v":9},"-",{"$f":"SUM(F148:F152)","v":5},{"$f":"IF(D148<F148,1,0)+IF(D149<F149,1,0)+IF(D150<F150,1,0)+IF(D151<F151,1,0)","v":0},{"$f":"'Team Groups'!C24","v":"GERMANY (U19)"},null,{"$f":"'Team Groups'!B18","v":"ITALY (Ladies)"}]
[33,"Steffen Despretz",null,1,"-",1,null,"Moritz Jung"]
[34,"Nathan Dizier",null,2,"-",1,null,"Alwin Krause "]
[35,"Florian Giaux",null,4,"-",1,null,"Fabio Bianco"]
[36,"William Van den Houte",null,2,"-",2,null,"Kai Hagenkötter"]
["Sub","Martin Antoine"]
[]
["37 à 40",{"$f":"'Team Groups'!D24","v":"PORTUGAL (U19)"},{"$f":"IF(D155>F155,1,0)+IF(D156>F156,1,0)+IF(D157>F157,1,0)+IF(D158>F158,1,0)","v":1},{"$f":"SUM(D155:D159)","v":4},"-",{"$f":"SUM(F155:F159)","v":10},{"$f":"IF(D155<F155,1,0)+IF(D156<F156,1,0)+IF(D157<F157,1,0)+IF(D158<F158,1,0)","v":2},{"$f":"'Team Groups'!E24","v":"FRANCE (U19)"},null,{"$f":"'Team Groups'!C18","v":"GERMANY (Ladies)"}]
[37,"Carolina Villarigues",null,1,"-",2,null,"Paul Naszalyi"]
[38,"Ricardo Jose",null,1,"-",1,null,"Raphaël Pommier"]
[39,"Vasco Henriques",null,0,"-",6,null,"Théo Modeste"]
[40,"Afonso Pereira",null,2,"-",1,null,"Arnaud Le Teno"]
["Sub"]
[]
["41 à 44",{"$f":"'Team Groups'!F29","v":"AUSTRIA  (U15)"},{"$f":"IF(D162>F162,1,0)+IF(D163>F163,1,0)+IF(D164>F164,1,0)+IF(D165>F165,1,0)","v":4},{"$f":"SUM(D162:D166)","v":14},"-",{"$f":"SUM(F162:F166)","v":3},{"$f":"IF(D162<F162,1,0)+IF(D163<F163,1,0)+IF(D164<F164,1,0)+IF(D165<F165,1,0)","v":0},{"$f":"'Team Groups'!G29","v":"FRANCE (U15)"},null,{"$f":"'Team Groups'!B23","v":"ITALY (U19)"}]
[41,"Daniel Vranowitz",null,3,"-",0,null,"Florentine Ausset"]
[42,"Marios Strommer",null,6,"-",3,null,"Eliott Legall"]
[43,"Lukas Eppensteiner",null,2,"-",0,null,"Paul Offmann"]
[44,"Adam Kraus",null,3,"-",0,"ff"]
["Sub","Jonathan Nichtenberger"]
[]
["45 à 48",{"$f":"'Team Groups'!E29","v":"SPAIN  (U15)"},{"$f":"IF(D169>F169,1,0)+IF(D170>F170,1,0)+IF(D171>F171,1,0)+IF(D172>F172,1,0)","v":0},{"$f":"SUM(D169:D173)","v":2},"-",{"$f":"SUM(F169:F173)","v":23},{"$f":"IF(D169<F169,1,0)+IF(D170<F170,1,0)+IF(D171<F171,1,0)+IF(D172<F172,1,0)","v":4},{"$f":"'Team Groups'!B29","v":"ITALY (U15)"},null,{"$f":"'Team Groups'!D23","v":"MALTA (U19)"}]
[45,"Antonio Garcia Fernandez",null,2,"-",3,null,"Claudio La Torre"]
[46,"Jorge Pinero",null,0,"-",10,null,"Antonio La Torre"]
[47,"Gonzalo Garcia- Guereta",null,0,"-",7,null,"Leonardo Giudice"]
[48,null,"ff",0,"-",3,null,"Andrea Bolognino"]
["Sub"]
[]
[]
["Série 3 - 11h00"]
[]
["Tables"]
[null,null,null,null,null,null,null,null,null,"Referees"]
[]
["1 à 4",{"$f":"'Team Groups'!D3","v":"USA (Open)"},{"$f":"IF(D182>F182,1,0)+IF(D183>F183,1,0)+IF(D184>F184,1,0)+IF(D185>F185,1,0)","v":1},{"$f":"SUM(D182:D186)","v":8},"-",{"$f":"SUM(F182:F186)","v":9},{"$f":"IF(D182<F182,1,0)+IF(D183<F183,1,0)+IF(D184<F184,1,0)+IF(D185<F185,1,0)","v":2},{"$f":"'Team Groups'!C3","v":"GERMANY (Open)"},null,{"$f":"'Team Groups'!D4","v":"GREECE (Open)"}]
[1,"Christian Filippella",null,2,"-",0,null,"Marcus Tilgner"]
[2,"Patrick Sheridan",null,2,"-",2,null,"Janus Gersie"]
[3,"Mike Tillman",null,2,"-",3,null,"Marcel Kwiatkowski"]
[4,"Daniel Cranston",null,2,"-",4,null,"Alexander Ruf"]
["Sub"]
[]
["5 à 8",{"$f":"'Team Groups'!B5","v":"ITALY (Open)"},{"$f":"IF(D189>F189,1,0)+IF(D190>F190,1,0)+IF(D191>F191,1,0)+IF(D192>F192,1,0)","v":3},{"$f":"SUM(D189:D193)","v":14},"-",{"$f":"SUM(F189:F193)","v":8},{"$f":"IF(D189<F189,1,0)+IF(D190<F190,1,0)+IF(D191<F191,1,0)+IF(D192<F192,1,0)","v":1},{"$f":"'Team Groups'!D5","v":"NETHERLAND (Open)"},null,{"$f":"'Team Groups'!B4","v":"AUSTRIA (Open)"}]
[5,"Luca Zambello",null,5,"-",1,null,"Maikel de Haas"]
[6,"Luca Colangelo",null,4,"-",2,null,"Kenney Gerrets"]
[7,"Saverio Bari",null,2,"-",1,null,"Henk Landzaat"]
[8,"Daniele Bertelli",null,3,"-",4,null,"Patrick de Jong"]
["Sub"]
[]
["9 à 12",{"$f":"'Team Groups'!C5","v":"JAPAN (Open)"},{"$f":"IF(D196>F196,1,0)+IF(D197>F197,1,0)+IF(D198>F198,1,0)+IF(D199>F199,1,0)","v":0},{"$f":"SUM(D196:D200)","v":2},"-",{"$f":"SUM(F196:F200)","v":12},{"$f":"IF(D196<F196,1,0)+IF(D197<F197,1,0)+IF(D198<F198,1,0)+IF(D199<F199,1,0)","v":4},{"$f":"'Team Groups'!E5","v":"ENGLAND (Open)"},null,{"$f":"'Team Groups'!D12","v":"GILBRALTAR (Veteran)"}]
[9,"Suguru Fujino",null,1,"-",3,null,"Terry Arnold"]
[10,"Hideaki Wada",null,1,"-",3,null,"Matthew Atkin"]
[11,"Koshiro Shibata",null,0,"-",3,null,"Brett Price"]
[12,null,null,0,"-",3,null,"Luca Martinelli"]
["Sub"]
[]
["13 à 16",{"$f":"'Team Groups'!B6","v":"BELGIUM (Open)"},{"$f":"IF(D203>F203,1,0)+IF(D204>F204,1,0)+IF(D205>F205,1,0)+IF(D206>F206,1,0)","v":4},{"$f":"SUM(D203:D207)","v":20},"-",{"$f":"SUM(F203:F207)","v":0},{"$f":"IF(D203<F203,1,0)+IF(D204<F204,1,0)+IF(D205<F205,1,0)+IF(D206<F206,1,0)","v":0},{"$f":"'Team Groups'!D6","v":"PORTUGAL (Open)"},null,{"$f":"'Team Groups'!E4","v":"RUSSIA (Open)"}]
[13,"Bessim Golger",null,8,"-",0,null,"Nuno Henriques"]
[14,"Sami Targui",null,3,"-",0,null,"Sergio Ramos"]
[15,"Sébastien Scheen",null,4,"-",0,null,"Luis Abreu"]
[16,"Valéry Dejardin",null,5,"-",0,null,"Diogo Pereira"]
["Sub"]
[]
["17 à 20",{"$f":"'Team Groups'!C6","v":"FRANCE (Open)"},{"$f":"IF(D210>F210,1,0)+IF(D211>F211,1,0)+IF(D212>F212,1,0)+IF(D213>F213,1,0)","v":4},{"$f":"SUM(D210:D214)","v":19},"-",{"$f":"SUM(F210:F214)","v":1},{"$f":"IF(D210<F210,1,0)+IF(D211<F211,1,0)+IF(D212<F212,1,0)+IF(D213<F213,1,0)","v":0},{"$f":"'Team Groups'!E6","v":"GILBRALTAR (Open)"},null,{"$f":"'Team Groups'!C4","v":"SCOTLAND (Open)"}]
[17,"Rémi Soret",null,4,"-",1,null,"Lawrence Alvarez"]
[18,"Romain Lafontaine",null,6,"-",0,null,"Niall Dean"]
[19,"Jean-Marie Amberny",null,5,"-",0,null,"Francis Avellano"]
[20,"Axel Donval",null,4,"-",0,null,"Jonathan Dotto"]
["Sub"]
[]
["21 à 24",{"$f":"'Team Groups'!D11","v":"BELGIUM (Veteran)"},{"$f":"IF(D217>F217,1,0)+IF(D218>F218,1,0)+IF(D219>F219,1,0)+IF(D220>F220,1,0)","v":2},{"$f":"SUM(D217:D221)","v":7},"-",{"$f":"SUM(F217:F221)","v":6},{"$f":"IF(D217<F217,1,0)+IF(D218<F218,1,0)+IF(D219<F219,1,0)+IF(D220<F220,1,0)","v":1},{"$f":"'Team Groups'!C11","v":"FRANCE (Veteran)"},null,{"$f":"'Team Groups'!B12","v":"ITALY (Veteran)"}]
[21,"Eric  Threis",null,1,"-",3,null,"Stéphane Pommier"]
[22,"Pascal Scheen",null,2,"-",2,null,"Axel Modeste"]
[23,"Benoît Massart",null,3,"-",1,null,"Thierry Vivron"]
[24,"Daniel Scheen",null,1,"-",0,null,"Xavier Dubois"]
["Sub",null,null,null,null,null,null,"Eric Naszalyi"]
[]
["25 à 28",{"$f":"'Team Groups'!B13","v":"AUSTRIA (Veteran)"},{"$f":"IF(D224>F224,1,0)+IF(D225>F225,1,0)+IF(D226>F226,1,0)+IF(D227>F227,1,0)","v":3},{"$f":"SUM(D224:D228)","v":10},"-",{"$f":"SUM(F224:F228)","v":7},{"$f":"IF(D224<F224,1,0)+IF(D225<F225,1,0)+IF(D226<F226,1,0)+IF(D227<F227,1,0)","v":0},{"$f":"'Team Groups'!D13","v":"GERMANY (Veteran)"},null,{"$f":"'Team Groups'!C12","v":"GREECE (Veteran)"}]
[25,"Günther Bamberzky",null,3,"-",3,null,"Tom Horn"]
[26,"Erich Hinkelmann",null,3,"-",2,null,"Arnold Mair"]
[27,"David Busch",null,2,"-",1,null,"Frank Stiller"]
[28,"Manfred Pawlica",null,2,"-",1,null,"Rainer Vogt"]
["Sub","Karl-Heinz Haider"]
[]
["29 à 32",{"$f":"'Team Groups'!C13","v":"ENGLAND (Veteran)"},{"$f":"IF(D231>F231,1,0)+IF(D232>F232,1,0)+IF(D233>F233,1,0)+IF(D234>F234,1,0)","v":3},{"$f":"SUM(D231:D235)","v":10},"-",{"$f":"SUM(F231:F235)","v":0},{"$f":"IF(D231<F231,1,0)+IF(D232<F232,1,0)+IF(D233<F233,1,0)+IF(D234<F234,1,0)","v":0},{"$f":"'Team Groups'!E13","v":"USA (Veteran)"},null,{"$f":"'Team Groups'!E12","v":"MALTA (Veteran)"}]
[29,"Brian Daley",null,3,"-",0,null,"Dario Passadore"]
[30,"Justin Finch",null,5,"-",0,null,"Paul O'Donovan Rossa"]
[31,"Phil Redman",null,2,"-",0,null,"Gregg Deinhart"]
[32,"Jeremy Bradley",null,0,"-",0,null,"Paul Eyes"]
["Sub"]
[]
["33 à 36",{"$f":"'Team Groups'!B18","v":"ITALY (Ladies)"},{"$f":"IF(D238>F238,1,0)+IF(D239>F239,1,0)+IF(D240>F240,1,0)+IF(D241>F241,1,0)","v":3},{"$f":"SUM(D238:D242)","v":19},"-",{"$f":"SUM(F238:F242)","v":3},{"$f":"IF(D238<F238,1,0)+IF(D239<F239,1,0)+IF(D240<F240,1,0)+IF(D241<F241,1,0)","v":0},{"$f":"'Team Groups'!C18","v":"GERMANY (Ladies)"},null,{"$f":"'Team Groups'!B24","v":"BELGIUM (U19)"}]
[33,"Paola Forlani",null,5,"-",1,null,"Daria Prazynski"]
[34,"Giuditta Lo Cascio",null,2,"-",2,null,"Victoria Büsing"]
[35,"Hélène Boniface",null,8,"-",0,null,"Conny Vulpes"]
[36,"Giulia Brillantino",null,4,"-",0,null,"Maike Krause"]
["Sub"]
[]
["37 à 40",{"$f":"'Team Groups'!D18","v":"BELGIUM (Ladies)"},{"$f":"IF(D245>F245,1,0)+IF(D246>F246,1,0)+IF(D247>F247,1,0)+IF(D248>F248,1,0)","v":3},{"$f":"SUM(D245:D249)","v":13},"-",{"$f":"SUM(F245:F249)","v":7},{"$f":"IF(D245<F245,1,0)+IF(D246<F246,1,0)+IF(D247<F247,1,0)+IF(D248<F248,1,0)","v":1},{"$f":"'Team Groups'!E18","v":"FRANCE (Ladies)"},null,{"$f":"'Team Groups'!D24","v":"PORTUGAL (U19)"}]
[37,"Emilie Despretz",null,7,"-",0,null,"Arielle Briant"]
[38,"Lydie Pinchart",null,3,"-",1,null,"Sylvie Guyot "]
[39,"Cynthia Bouchez",null,1,"-",5,null,"Audrey Herbaut"]
[40,"Elodie Bertholet",null,2,"-",1,null,"Françoise Guyot"]
["Sub","Delphine Dieudonné"]
[]
["41 à 44",{"$f":"'Team Groups'!D23","v":"MALTA (U19)"},{"$f":"IF(D252>F252,1,0)+IF(D253>F253,1,0)+IF(D254>F254,1,0)+IF(D255>F255,1,0)","v":1},{"$f":"SUM(D252:D256)","v":5},"-",{"$f":"SUM(F252:F256)","v":12},{"$f":"IF(D252<F252,1,0)+IF(D253<F253,1,0)+IF(D254<F254,1,0)+IF(D255<F255,1,0)","v":3},{"$f":"'Team Groups'!C23","v":"ENGLAND (U19)"},null,{"$f":"'Team Groups'!B11","v":"SPAIN (Veteran)"}]
[41,"Joseph Agius",null,0,"-",5,null,"Elliott Bellefontaine"]
[42,"Nealmark Bonnici",null,2,"-",4,null,"Connor Bowden"]
[43,"Jurgen Balzan",null,3,"-",0,null,"Chris Bowen"]
[44,null,"ff",0,"-",3,null,"Kye Arnold"]
["Sub"]
[]
["45 à 48",{"$f":"'Team Groups'!C29","v":"ENGLAND (U15)"},{"$f":"IF(D259>F259,1,0)+IF(D260>F260,1,0)+IF(D261>F261,1,0)+IF(D262>F262,1,0)","v":2},{"$f":"SUM(D259:D263)","v":7},"-",{"$f":"SUM(F259:F263)","v":7},{"$f":"IF(D259<F259,1,0)+IF(D260<F260,1,0)+IF(D261<F261,1,0)+IF(D262<F262,1,0)","v":2},{"$f":"'Team Groups'!G29","v":"FRANCE (U15)"},null,{"$f":"'Team Groups'!C24","v":"GERMANY (U19)"}]
[45,"Joshua Foreman",null,1,"-",4,null,"Paul Offmann"]
[46,"Rhys Williams",null,1,"-",3,null,"Eliott Legall"]
[47,"Thomas Price",null,2,"-",0,null,"Florentine Ausset"]
[48,"Conor Atkin",null,3,"-",0,"ff"]
["Sub"]
[]
["49 à 52",{"$f":"'Team Groups'!D29","v":"BELGIUM (U15)"},{"$f":"IF(D266>F266,1,0)+IF(D267>F267,1,0)+IF(D268>F268,1,0)+IF(D269>F269,1,0)","v":2},{"$f":"SUM(D266:D270)","v":9},"-",{"$f":"SUM(F266:F270)","v":7},{"$f":"IF(D266<F266,1,0)+IF(D267<F267,1,0)+IF(D268<F268,1,0)+IF(D269<F269,1,0)","v":2},{"$f":"'Team Groups'!F29","v":"AUSTRIA  (U15)"},null,{"$f":"'Team Groups'!E24","v":"FRANCE (U19)"}]
[49,"Mathéo Grégoire",null,0,"-",1,null,"Lukas Eppensteiner"]
[50,"Corentin Bouchez",null,5,"-",1,null,"Jonathan Nichtenberger"]
[51,"Louison Giaux",null,1,"-",5,null,"Marios Strommer"]
[52,"Maxime Rairoux",null,3,"-",0,null,"Adam Kraus"]
["Sub",null,null,null,null,null,null,"Daniel Vranowitz"]
[]
[]
["Série 4 - 12h00"]
[]
["Tables"]
[null,null,null,null,null,null,null,null,null,"Referees"]
[]
["1 à 4",{"$f":"'Team Groups'!E4","v":"RUSSIA (Open)"},{"$f":"IF(D279>F279,1,0)+IF(D280>F280,1,0)+IF(D281>F281,1,0)+IF(D282>F282,1,0)","v":0},{"$f":"SUM(D279:D283)","v":0},"-",{"$f":"SUM(F279:F283)","v":37},{"$f":"IF(D279<F279,1,0)+IF(D280<F280,1,0)+IF(D281<F281,1,0)+IF(D282<F282,1,0)","v":4},{"$f":"'Team Groups'!B4","v":"AUSTRIA (Open)"},null,{"$f":"'Team Groups'!C6","v":"FRANCE (Open)"}]
[1,"Andrey Kudryashov",null,0,"-",14,null,"Wolfgang Haas"]
[2,"Dmitry Lavrentcov",null,0,"-",12,null,"Thomas Wittmann"]
[3,"Maksim Gulyev",null,0,"-",4,null,"Christian Haas"]
[4,"Aton Volkov",null,0,"-",7,null,"Wolfgang Leitner"]
["Sub",null,null,null,null,null,null,"Heinz Eder"]
[]
["5 à 8",{"$f":"'Team Groups'!C4","v":"SCOTLAND (Open)"},{"$f":"IF(D286>F286,1,0)+IF(D287>F287,1,0)+IF(D288>F288,1,0)+IF(D289>F289,1,0)","v":0},{"$f":"SUM(D286:D290)","v":3},"-",{"$f":"SUM(F286:F290)","v":16},{"$f":"IF(D286<F286,1,0)+IF(D287<F287,1,0)+IF(D288<F288,1,0)+IF(D289<F289,1,0)","v":4},{"$f":"'Team Groups'!D4","v":"GREECE (Open)"},null,{"$f":"'Team Groups'!E6","v":"GILBRALTAR (Open)"}]
[5,"Rob Conway",null,1,"-",3,null,"Spyros Patrinos"]
[6,"Andy Beskaby",null,0,"-",5,null,"Lazaros Papakonstantinou"]
[7,"Malcolm Lees",null,0,"-",5,null,"Kostas Seses"]
[8,"Gareth Christie",null,2,"-",3,null,"Nikos Haratsis"]
["Sub",null,null,null,null,null,null,"Giorgos Koutis"]
[]
["9 à 12",{"$f":"'Team Groups'!E5","v":"ENGLAND (Open)"},{"$f":"IF(D293>F293,1,0)+IF(D294>F294,1,0)+IF(D295>F295,1,0)+IF(D296>F296,1,0)","v":0},{"$f":"SUM(D293:D297)","v":3},"-",{"$f":"SUM(F293:F297)","v":39},{"$f":"IF(D293<F293,1,0)+IF(D294<F294,1,0)+IF(D295<F295,1,0)+IF(D296<F296,1,0)","v":4},{"$f":"'Team Groups'!B5","v":"ITALY (Open)"},null,{"$f":"'Team Groups'!D6","v":"PORTUGAL (Open)"}]
[9,"Terry Arnold",null,0,"-",12,null,"Luca Zambello"]
[10,"Luca Martinelli",null,2,"-",4,null,"Massimo Bolognino"]
[11,"Brett Price",null,1,"-",11,null,"Luca Colangelo"]
[12,"Matthew Atkin",null,0,"-",12,null,"Massimiliano Nastasi"]
["Sub"]
[]
["13 à 16",{"$f":"'Team Groups'!C5","v":"JAPAN (Open)"},{"$f":"IF(D300>F300,1,0)+IF(D301>F301,1,0)+IF(D302>F302,1,0)+IF(D303>F303,1,0)","v":0},{"$f":"SUM(D300:D304)","v":0},"-",{"$f":"SUM(F300:F304)","v":12},{"$f":"IF(D300<F300,1,0)+IF(D301<F301,1,0)+IF(D302<F302,1,0)+IF(D303<F303,1,0)","v":4},{"$f":"'Team Groups'!D5","v":"NETHERLAND (Open)"},null,{"$f":"'Team Groups'!B6","v":"BELGIUM (Open)"}]
[13,"Hideaki Wada",null,0,"-",4,null,"Kenney Gerrets"]
[14,"Suguru Fujino",null,0,"-",4,null,"Patrick de Jong"]
[15,"Koshiro Shibata",null,0,"-",1,null,"Mirjam de Jong"]
[16,null,"ff",0,"-",3,null,"Maikel de Haas"]
["Sub"]
[]
["17 à 20",{"$f":"'Team Groups'!C11","v":"FRANCE (Veteran)"},{"$f":"IF(D307>F307,1,0)+IF(D308>F308,1,0)+IF(D309>F309,1,0)+IF(D310>F310,1,0)","v":1},{"$f":"SUM(D307:D311)","v":8},"-",{"$f":"SUM(F307:F311)","v":14},{"$f":"IF(D307<F307,1,0)+IF(D308<F308,1,0)+IF(D309<F309,1,0)+IF(D310<F310,1,0)","v":2},{"$f":"'Team Groups'!B11","v":"SPAIN (Veteran)"},null,{"$f":"'Team Groups'!D13","v":"GERMANY (Veteran)"}]
[17,"Xavier Dubois",null,0,"-",4,null,"Antonio Montano"]
[18,"Stéphane Pommier",null,1,"-",1,null,"Juan Carlos Granados"]
[19,"Axel Modeste",null,1,"-",5,null,"Vicenç Prats Salat"]
[20,"Eric Naszalyi",null,6,"-",4,null,"Luis Lopez "]
["Sub","Thierry Vivron",null,null,null,null,null,"Ferran Coll"]
[]
["21 à 24",{"$f":"'Team Groups'!E12","v":"MALTA (Veteran)"},{"$f":"IF(D314>F314,1,0)+IF(D315>F315,1,0)+IF(D316>F316,1,0)+IF(D317>F317,1,0)","v":1},{"$f":"SUM(D314:D318)","v":4},"-",{"$f":"SUM(F314:F318)","v":6},{"$f":"IF(D314<F314,1,0)+IF(D315<F315,1,0)+IF(D316<F316,1,0)+IF(D317<F317,1,0)","v":1},{"$f":"'Team Groups'!B12","v":"ITALY (Veteran)"},null,{"$f":"'Team Groups'!B13","v":"AUSTRIA (Veteran)"}]
[21,"Massimo Cremona",null,1,"-",0,null,"Massimiliano Croatti"]
[22,"Charles Aquilina",null,2,"-",2,null,"Patrizio Lazzaretti"]
[23,"Jason Pisani",null,1,"-",1,null,"Mario Corradi"]
[24,"John Zammit",null,0,"-",3,null,"Stefano De Francesco"]
["Sub",null,null,null,null,null,null,"Gianfranco Calonico"]
[]
["25 à 28",{"$f":"'Team Groups'!C12","v":"GREECE (Veteran)"},{"$f":"IF(D321>F321,1,0)+IF(D322>F322,1,0)+IF(D323>F323,1,0)+IF(D324>F324,1,0)","v":2},{"$f":"SUM(D321:D325)","v":11},"-",{"$f":"SUM(F321:F325)","v":6},{"$f":"IF(D321<F321,1,0)+IF(D322<F322,1,0)+IF(D323<F323,1,0)+IF(D324<F324,1,0)","v":1},{"$f":"'Team Groups'!D12","v":"GILBRALTAR (Veteran)"},null,{"$f":"'Team Groups'!C13","v":"ENGLAND (Veteran)"}]
[25,"Chris Aggelinas",null,1,"-",1,null,"Guy Palmer"]
[26,"Dimitris Stamatopoulos",null,4,"-",1,null,"Jose Luis Bonavia"]
[27,"Nikos Naskos",null,5,"-",2,null,"Patrick Dean"]
[28,"Panagiotis Haratsis",null,1,"-",2,null,"John Field"]
["Sub"]
[]
["29 à 32",{"$f":"'Team Groups'!B18","v":"ITALY (Ladies)"},{"$f":"IF(D328>F328,1,0)+IF(D329>F329,1,0)+IF(D330>F330,1,0)+IF(D331>F331,1,0)","v":2},{"$f":"SUM(D328:D332)","v":6},"-",{"$f":"SUM(F328:F332)","v":9},{"$f":"IF(D328<F328,1,0)+IF(D329<F329,1,0)+IF(D330<F330,1,0)+IF(D331<F331,1,0)","v":2},{"$f":"'Team Groups'!D18","v":"BELGIUM (Ladies)"},null,{"$f":"'Team Groups'!E13","v":"USA (Veteran)"}]
[29,"Giulia Brillantino",null,0,"-",6,null,"Delphine Dieudonné"]
[30,"Giuditta Lo Cascio",null,4,"-",0,null,"Margault Delval"]
[31,"Eleonora Buttitta",null,1,"-",0,null,"Lydie Pinchart"]
[32,"Paola Forlani",null,1,"-",3,null,"Emilie Despretz"]
["Sub"]
[]
["33 à 36",{"$f":"'Team Groups'!C18","v":"GERMANY (Ladies)"},{"$f":"IF(D335>F335,1,0)+IF(D336>F336,1,0)+IF(D337>F337,1,0)+IF(D338>F338,1,0)","v":1},{"$f":"SUM(D335:D339)","v":3},"-",{"$f":"SUM(F335:F339)","v":8},{"$f":"IF(D335<F335,1,0)+IF(D336<F336,1,0)+IF(D337<F337,1,0)+IF(D338<F338,1,0)","v":2},{"$f":"'Team Groups'!E18","v":"FRANCE (Ladies)"},null,{"$f":"'Team Groups'!B3","v":"SPAIN (Open)"}]
[33,"Maike Krause",null,0,"-",3,null,"Audrey Herbaut"]
[34,"Daria Prazynski",null,0,"-",0,null,"Sylvie Guyot "]
[35,"Victoria Büsing",null,3,"-",1,null,"Françoise Guyot"]
[36,"Conny Vulpes",null,0,"-",4,null,"Arielle Briant"]
["Sub"]
[]
["37 à 40",{"$f":"'Team Groups'!B24","v":"BELGIUM (U19)"},{"$f":"IF(D342>F342,1,0)+IF(D343>F343,1,0)+IF(D344>F344,1,0)+IF(D345>F345,1,0)","v":4},{"$f":"SUM(D342:D346)","v":22},"-",{"$f":"SUM(F342:F346)","v":4},{"$f":"IF(D342<F342,1,0)+IF(D343<F343,1,0)+IF(D344<F344,1,0)+IF(D345<F345,1,0)","v":0},{"$f":"'Team Groups'!D24","v":"PORTUGAL (U19)"},null,{"$f":"'Team Groups'!C3","v":"GERMANY (Open)"}]
[37,"Nathan Dizier",null,5,"-",0,null,"Ricardo Jose"]
[38,"Martin Antoine",null,3,"-",2,null,"Afonso Pereira"]
[39,"Florian Giaux",null,8,"-",1,null,"Carolina Villarigues"]
[40,"Steffen Despretz",null,6,"-",1,null,"Vasco Henriques"]
["Sub","William Van den Houte"]
[]
["41 à 44",{"$f":"'Team Groups'!C24","v":"GERMANY (U19)"},{"$f":"IF(D349>F349,1,0)+IF(D350>F350,1,0)+IF(D351>F351,1,0)+IF(D352>F352,1,0)","v":2},{"$f":"SUM(D349:D353)","v":7},"-",{"$f":"SUM(F349:F353)","v":4},{"$f":"IF(D349<F349,1,0)+IF(D350<F350,1,0)+IF(D351<F351,1,0)+IF(D352<F352,1,0)","v":1},{"$f":"'Team Groups'!E24","v":"FRANCE (U19)"},null,{"$f":"'Team Groups'!D11","v":"BELGIUM (Veteran)"}]
[41,"Moritz Jung",null,1,"-",0,null,"Raphaël Pommier"]
[42,"Kai Hagenkötter",null,4,"-",0,null,"Paul Naszalyi"]
[43,"Alwin Krause ",null,1,"-",1,null,"Arnaud Le Teno"]
[44,"Fabio Bianco",null,1,"-",3,null,"Théo Modeste"]
["Sub"]
[]
["45 à 48",{"$f":"'Team Groups'!G29","v":"FRANCE (U15)"},{"$f":"IF(D356>F356,1,0)+IF(D357>F357,1,0)+IF(D358>F358,1,0)+IF(D359>F359,1,0)","v":0},{"$f":"SUM(D356:D360)","v":2},"-",{"$f":"SUM(F356:F360)","v":19},{"$f":"IF(D356<F356,1,0)+IF(D357<F357,1,0)+IF(D358<F358,1,0)+IF(D359<F359,1,0)","v":4},{"$f":"'Team Groups'!B29","v":"ITALY (U15)"},null,{"$f":"'Team Groups'!C23","v":"ENGLAND (U19)"}]
[45,"Paul Offmann",null,2,"-",7,null,"Leonardo Giudice"]
[46,"Eliott Legall",null,0,"-",1,null,"Andrea Bolognino"]
[47,"Florentine Ausset",null,0,"-",8,null,"Matteo Brillantino"]
[48,null,"ff",0,"-",3,null,"Riccardo Lazzari"]
["Sub"]
[]
["49 à 52",{"$f":"'Team Groups'!C29","v":"ENGLAND (U15)"},{"$f":"IF(D363>F363,1,0)+IF(D364>F364,1,0)+IF(D365>F365,1,0)+IF(D366>F366,1,0)","v":0},{"$f":"SUM(D363:D367)","v":3},"-",{"$f":"SUM(F363:F367)","v":19},{"$f":"IF(D363<F363,1,0)+IF(D364<F364,1,0)+IF(D365<F365,1,0)+IF(D366<F366,1,0)","v":3},{"$f":"'Team Groups'!D29","v":"BELGIUM (U15)"},null,{"$f":"'Team Groups'!D3","v":"USA (Open)"}]
[49,"Rhys Williams",null,1,"-",1,null,"Mathéo Grégoire"]
[50,"Conor Atkin",null,0,"-",5,null,"Corentin Boltz"]
[51,"Joshua Foreman",null,1,"-",5,null,"Louison Giaux"]
[52,"Thomas Price",null,1,"-",8,null,"Corentin Bouchez"]
["Sub",null,null,null,null,null,null,"Maxime Rairoux"]
[]
[]
["Série 5 - 13h00"]
[]
["Tables"]
[null,null,null,null,null,null,null,null,null,"Referees"]
[]
["1 à 4",{"$f":"'Team Groups'!C3","v":"GERMANY (Open)"},{"$f":"IF(D376>F376,1,0)+IF(D377>F377,1,0)+IF(D378>F378,1,0)+IF(D379>F379,1,0)","v":0},{"$f":"SUM(D376:D380)","v":8},"-",{"$f":"SUM(F376:F380)","v":26},{"$f":"IF(D376<F376,1,0)+IF(D377<F377,1,0)+IF(D378<F378,1,0)+IF(D379<F379,1,0)","v":4},{"$f":"'Team Groups'!B3","v":"SPAIN (Open)"},null,{"$f":"'Team Groups'!C4","v":"SCOTLAND (Open)"}]
[1,"Marcus Tilgner",null,2,"-",5,null,"David Gonzalez"]
[2,"Marcel Kwiatkowski",null,2,"-",9,null,"Juan Manuel Noguera"]
[3,"Janus Gersie",null,0,"-",3,null,"Antonio Casin"]
[4,"Alexander Ruf",null,4,"-",9,null,"Carlos Flores"]
["Sub"]
[]
["5 à 8",{"$f":"'Team Groups'!E6","v":"GILBRALTAR (Open)"},{"$f":"IF(D383>F383,1,0)+IF(D384>F384,1,0)+IF(D385>F385,1,0)+IF(D386>F386,1,0)","v":0},{"$f":"SUM(D383:D387)","v":11},"-",{"$f":"SUM(F383:F387)","v":31},{"$f":"IF(D383<F383,1,0)+IF(D384<F384,1,0)+IF(D385<F385,1,0)+IF(D386<F386,1,0)","v":4},{"$f":"'Team Groups'!B6","v":"BELGIUM (Open)"},null,"JAPAN (Open)"]
[5,"Francis Avellano",null,5,"-",8,null,"Sébastien Scheen"]
[6,"Jonathan Dotto",null,2,"-",9,null,"Bessim Golger"]
[7,"Niall Dean",null,2,"-",7,null,"Rémy Huynh"]
[8,"Lawrence Alvarez",null,2,"-",7,null,"Christophe Dheur"]
["Sub"]
[]
["9 à 12",{"$f":"'Team Groups'!C6","v":"FRANCE (Open)"},{"$f":"IF(D390>F390,1,0)+IF(D391>F391,1,0)+IF(D392>F392,1,0)+IF(D393>F393,1,0)","v":3},{"$f":"SUM(D390:D394)","v":14},"-",{"$f":"SUM(F390:F394)","v":7},{"$f":"IF(D390<F390,1,0)+IF(D391<F391,1,0)+IF(D392<F392,1,0)+IF(D393<F393,1,0)","v":0},{"$f":"'Team Groups'!D6","v":"PORTUGAL (Open)"},null,{"$f":"'Team Groups'!D4","v":"GREECE (Open)"}]
[9,"Fayçal Rouis",null,2,"-",2,null,"Sergio Ramos"]
[10,"Romain Lafontaine",null,6,"-",1,null,"Nuno Henriques"]
[11,"Jean-Guillaume Einsle",null,4,"-",3,null,"Diogo Pereira"]
[12,"Rémi Soret",null,2,"-",1,null,"Luis Abreu"]
["Sub","Axel Donval"]
[]
["13 à 16",{"$f":"'Team Groups'!E13","v":"USA (Veteran)"},{"$f":"IF(D397>F397,1,0)+IF(D398>F398,1,0)+IF(D399>F399,1,0)+IF(D400>F400,1,0)","v":0},{"$f":"SUM(D397:D401)","v":7},"-",{"$f":"SUM(F397:F401)","v":16},{"$f":"IF(D397<F397,1,0)+IF(D398<F398,1,0)+IF(D399<F399,1,0)+IF(D400<F400,1,0)","v":3},{"$f":"'Team Groups'!B13","v":"AUSTRIA (Veteran)"},null,{"$f":"'Team Groups'!D5","v":"NETHERLAND (Open)"}]
[13,"Gregg Deinhart",null,2,"-",2,null,"David Busch"]
[14,"Paul Eyes",null,1,"-",3,null,"Manfred Pawlica"]
[15,"Paul O'Donovan Rossa",null,2,"-",4,null,"Günther Bamberzky"]
[16,"Dario Passadore",null,2,"-",7,null,"Erich Hinkelmann"]
["Sub"]
[]
["17 à 20",{"$f":"'Team Groups'!C13","v":"ENGLAND (Veteran)"},{"$f":"IF(D404>F404,1,0)+IF(D405>F405,1,0)+IF(D406>F406,1,0)+IF(D407>F407,1,0)","v":1},{"$f":"SUM(D404:D408)","v":5},"-",{"$f":"SUM(F404:F408)","v":7},{"$f":"IF(D404<F404,1,0)+IF(D405<F405,1,0)+IF(D406<F406,1,0)+IF(D407<F407,1,0)","v":2},{"$f":"'Team Groups'!D13","v":"GERMANY (Veteran)"},null,{"$f":"'Team Groups'!B5","v":"ITALY (Open)"}]
[17,"Brian Daley",null,2,"-",0,null,"Thossa Busing"]
[18,"Jeremy Bradley",null,0,"-",1,null,"Rainer Vogt"]
[19,"Justin Finch",null,3,"-",3,null,"Frank Hagenkötter"]
[20,"Phil Redman",null,0,"-",3,null,"Arnold Mair"]
["Sub"]
[]
["21 à 24",{"$f":"'Team Groups'!C23","v":"ENGLAND (U19)"},{"$f":"IF(D411>F411,1,0)+IF(D412>F412,1,0)+IF(D413>F413,1,0)+IF(D414>F414,1,0)","v":0},{"$f":"SUM(D411:D415)","v":5},"-",{"$f":"SUM(F411:F415)","v":23},{"$f":"IF(D411<F411,1,0)+IF(D412<F412,1,0)+IF(D413<F413,1,0)+IF(D414<F414,1,0)","v":4},{"$f":"'Team Groups'!B23","v":"ITALY (U19)"},null,"RUSSIA (Open)"]
[21,"Kye Arnold",null,1,"-",8,null,"Nicola Borgo"]
[22,"Connor Bowden",null,1,"-",5,null,"Marco Di Vito"]
[23,"Chris Bowen",null,0,"-",5,null,"Paolo Zambello"]
[24,"Elliott Bellefontaine",null,3,"-",5,null,"Andrea Ciccarelli"]
["Sub"]
[]
["25 à 28",{"$f":"'Team Groups'!E24","v":"FRANCE (U19)"},{"$f":"IF(D418>F418,1,0)+IF(D419>F419,1,0)+IF(D420>F420,1,0)+IF(D421>F421,1,0)","v":0},{"$f":"SUM(D418:D422)","v":8},"-",{"$f":"SUM(F418:F422)","v":17},{"$f":"IF(D418<F418,1,0)+IF(D419<F419,1,0)+IF(D420<F420,1,0)+IF(D421<F421,1,0)","v":3},{"$f":"'Team Groups'!B24","v":"BELGIUM (U19)"},null,"AUSTRIA (Open)"]
[25,"Raphaël Pommier",null,2,"-",7,null,"William Van den Houte"]
[26,"Paul Naszalyi",null,1,"-",4,null,"Steffen Despretz"]
[27,"Arnaud Le Teno",null,3,"-",3,null,"Florian Giaux"]
[28,"Théo Modeste",null,2,"-",3,null,"Martin Antoine"]
["Sub"]
[]
["29 à 32",{"$f":"'Team Groups'!C24","v":"GERMANY (U19)"},{"$f":"IF(D425>F425,1,0)+IF(D426>F426,1,0)+IF(D427>F427,1,0)+IF(D428>F428,1,0)","v":2},{"$f":"SUM(D425:D429)","v":11},"-",{"$f":"SUM(F425:F429)","v":6},{"$f":"IF(D425<F425,1,0)+IF(D426<F426,1,0)+IF(D427<F427,1,0)+IF(D428<F428,1,0)","v":1},{"$f":"'Team Groups'!D24","v":"PORTUGAL (U19)"},null,{"$f":"'Team Groups'!E5","v":"ENGLAND (Open)"}]
[29,"Moritz Jung",null,3,"-",3,null,"Carolina Villarigues"]
[30,"Fabio Bianco",null,2,"-",3,null,"Afonso Pereira"]
[31,"Kai Hagenkötter",null,5,"-",0,null,"Ricardo Jose"]
[32,"Alwin Krause ",null,1,"-",0,null,"Vasco Henriques"]
["Sub"]
[]
["33 à 36",{"$f":"'Team Groups'!F29","v":"AUSTRIA  (U15)"},{"$f":"IF(D432>F432,1,0)+IF(D433>F433,1,0)+IF(D434>F434,1,0)+IF(D435>F435,1,0)","v":3},{"$f":"SUM(D432:D436)","v":19},"-",{"$f":"SUM(F432:F436)","v":3},{"$f":"IF(D432<F432,1,0)+IF(D433<F433,1,0)+IF(D434<F434,1,0)+IF(D435<F435,1,0)","v":1},{"$f":"'Team Groups'!E29","v":"SPAIN  (U15)"},null,{"$f":"'Team Groups'!D12","v":"GILBRALTAR (Veteran)"}]
[33,"Daniel Vranowitz",null,5,"-",0,null,"Jorge Pinero"]
[34,"Lukas Eppensteiner",null,2,"-",3,null,"Antonio Garcia Fernandez"]
[35,"Marios Strommer",null,9,"-",0,null,"Gonzalo Garcia- Guereta"]
[36,"Jonathan Nichtenberger",null,3,"-",0,"ff"]
["Sub","Adam Kraus"]
[]
["37 à 40",{"$f":"'Team Groups'!B29","v":"ITALY (U15)"},{"$f":"IF(D439>F439,1,0)+IF(D440>F440,1,0)+IF(D441>F441,1,0)+IF(D442>F442,1,0)","v":3},{"$f":"SUM(D439:D443)","v":23},"-",{"$f":"SUM(F439:F443)","v":5},{"$f":"IF(D439<F439,1,0)+IF(D440<F440,1,0)+IF(D441<F441,1,0)+IF(D442<F442,1,0)","v":0},{"$f":"'Team Groups'!D29","v":"BELGIUM (U15)"},null,{"$f":"'Team Groups'!E12","v":"MALTA (Veteran)"}]
[37,"Claudio La Torre",null,9,"-",0,null,"Noé Scheen"]
[38,"Matteo Brillantino",null,1,"-",1,null,"Maxime Rairoux"]
[39,"Leonardo Giudice",null,6,"-",2,null,"Louison Giaux"]
[40,"Antonio La Torre",null,7,"-",2,null,"Corentin Bouchez"]
["Sub","Andrea Bolognino",null,null,null,null,null,"Corentin Boltz"]
[]
["41 à 44",{"$f":"'Team Groups'!B34","v":"ITALY (U12)"},{"$f":"IF(D446>F446,1,0)+IF(D447>F447,1,0)+IF(D448>F448,1,0)+IF(D449>F449,1,0)","v":4},{"$f":"SUM(D446:D450)","v":15},"-",{"$f":"SUM(F446:F450)","v":1},{"$f":"IF(D446<F446,1,0)+IF(D447<F447,1,0)+IF(D448<F448,1,0)+IF(D449<F449,1,0)","v":0},{"$f":"'Team Groups'!C34","v":"FRANCE (U12)"},null,{"$f":"'Team Groups'!C12","v":"GREECE (Veteran)"}]
[41,"Matteo Cammarata",null,3,"-",1,null,"Quentin Ausset"]
[42,"Mattia Ferrante",null,3,"-",0,null,"Louis Fouetillou"]
[43,"Giorgio Giudice",null,6,"-",0,null,"Victor Dubuc"]
[44,"Cristian Fricano",null,3,"-",0,null,"Marc Offmann"]
["Sub","Riccardo Natoli"]
[]
["45 à 48",{"$f":"'Team Groups'!D34","v":"SPAIN  (U12)"},{"$f":"IF(D453>F453,1,0)+IF(D454>F454,1,0)+IF(D455>F455,1,0)+IF(D456>F456,1,0)","v":1},{"$f":"SUM(D453:D457)","v":9},"-",{"$f":"SUM(F453:F457)","v":7},{"$f":"IF(D453<F453,1,0)+IF(D454<F454,1,0)+IF(D455<F455,1,0)+IF(D456<F456,1,0)","v":2},{"$f":"'Team Groups'!E34","v":"BELGIUM (U12)"},null,{"$f":"'Team Groups'!B12","v":"ITALY (Veteran)"}]
[45,"Paula Maireles",null,0,"-",1,null,"Jann Segers"]
[46,"Jesus Maireles",null,3,"-",3,null,"Aurélien Feye"]
[47,"Carlos Pinto",null,2,"-",3,null,"Basile Magermans"]
[48,"Kristian Sylagiev",null,4,"-",0,null,"Alex Genart"]
["Sub",null,null,null,null,null,null,"Lucas Pere"]
[]
[]
[]
["Série 6 - 14h10"]
[]
["Tables"]
[null,null,null,null,null,null,null,null,null,"Referees"]
[]
["1/4 final open"]
[]
["1 à 4",{"$f":"'Team Groups'!H45","v":"SPAIN (Open)"},{"$f":"IF(D469>F469,1,0)+IF(D470>F470,1,0)+IF(D471>F471,1,0)+IF(D472>F472,1,0)","v":4},{"$f":"SUM(D469:D473)","v":20},"-",{"$f":"SUM(F469:F473)","v":4},{"$f":"IF(D469<F469,1,0)+IF(D470<F470,1,0)+IF(D471<F471,1,0)+IF(D472<F472,1,0)","v":0},{"$f":"'Team Groups'!H61","v":"NETHERLAND (Open)"},null,{"$f":"'Team Groups'!H53","v":"SCOTLAND (Open)"},null,"M1"]
[1,"David Gonzalez",null,2,"-",0,null,"Kenney Gerrets"]
[2,"Juan Manuel Noguera",null,9,"-",1,null,"Henk Landzaat"]
[3,"Carlos Flores",null,6,"-",2,null,"Patrick de Jong"]
[4,"Antonio Casin",null,3,"-",1,null,"Maikel de Haas"]
["Sub"]
[]
["5 à 8",{"$f":"'Team Groups'!H52","v":"GREECE (Open)"},{"$f":"IF(D476>F476,1,0)+IF(D477>F477,1,0)+IF(D478>F478,1,0)+IF(D479>F479,1,0)","v":2},{"$f":"SUM(D476:D480)","v":5},"-",{"$f":"SUM(F476:F480)","v":4},{"$f":"IF(D476<F476,1,0)+IF(D477<F477,1,0)+IF(D478<F478,1,0)+IF(D479<F479,1,0)","v":1},{"$f":"'Team Groups'!H69","v":"BELGIUM (Open)"},null,{"$f":"'Team Groups'!H62","v":"ENGLAND (Open)"},null,"M2"]
[5,"Velissarios Fragakis",null,1,"-",1,null,"Sami Targui"]
[6,"Kostas Seses",null,1,"-",2,null,"Valéry Dejardin"]
[7,"Giorgos Koutis",null,1,"-",0,null,"Rémy Huynh"]
[8,"Spyros Hantzaras","sd",2,"-",1,null,"Bessim Golger"]
["Sub","Lazaros Papakonstantinou",null,null,null,null,null,"Christophe Dheur"]
[]
["9 à 12",{"$f":"'Team Groups'!H60","v":"ITALY (Open)"},{"$f":"IF(D483>F483,1,0)+IF(D484>F484,1,0)+IF(D485>F485,1,0)+IF(D486>F486,1,0)","v":3},{"$f":"SUM(D483:D487)","v":21},"-",{"$f":"SUM(F483:F487)","v":6},{"$f":"IF(D483<F483,1,0)+IF(D484<F484,1,0)+IF(D485<F485,1,0)+IF(D486<F486,1,0)","v":0},{"$f":"'Team Groups'!H46","v":"GERMANY (Open)"},null,{"$f":"'Team Groups'!H71","v":"PORTUGAL (Open)"},null,"M3"]
[9,"Massimiliano Nastasi",null,5,"-",2,null,"Marcel Kwiatkowski"]
[10,"Saverio Bari",null,7,"-",1,null,"Janus Gersie"]
[11,"Daniele Bertelli",null,7,"-",1,null,"Marcus Tilgner"]
[12,"Luca Colangelo",null,2,"-",2,null,"Alexander Ruf"]
["Sub"]
[]
["13 à 16",{"$f":"'Team Groups'!H70","v":"FRANCE (Open)"},{"$f":"IF(D490>F490,1,0)+IF(D491>F491,1,0)+IF(D492>F492,1,0)+IF(D493>F493,1,0)","v":1},{"$f":"SUM(D490:D494)","v":6},"-",{"$f":"SUM(F490:F494)","v":9},{"$f":"IF(D490<F490,1,0)+IF(D491<F491,1,0)+IF(D492<F492,1,0)+IF(D493<F493,1,0)","v":2},{"$f":"'Team Groups'!H51","v":"AUSTRIA (Open)"},null,{"$f":"'Team Groups'!H47","v":"USA (Open)"},null,"M4"]
[13,"Jean-Marie Amberny",null,0,"-",4,null,"Alexander Haas"]
[14,"Fayçal Rouis",null,3,"-",0,null,"Christian Haas"]
[15,"Jean-Guillaume Einsle",null,0,"-",2,null,"Wolfgang Leitner"]
[16,"Axel Donval",null,3,"-",3,null,"Wolfgang Haas"]
["Sub","Axel Donval",null,null,null,null,null,"Heinz Eder"]
[]
[]
["Barrages veteran"]
[]
["17 à 20",{"$f":"'Team Groups'!H96","v":"AUSTRIA (Veteran)"},{"$f":"IF(D500>F500,1,0)+IF(D501>F501,1,0)+IF(D502>F502,1,0)+IF(D503>F503,1,0)","v":1},{"$f":"SUM(D500:D504)","v":2},"-",{"$f":"SUM(F500:F504)","v":6},{"$f":"IF(D500<F500,1,0)+IF(D501<F501,1,0)+IF(D502<F502,1,0)+IF(D503<F503,1,0)","v":1},{"$f":"'Team Groups'!H82","v":"SPAIN (Veteran)"},null,{"$f":"'Team Groups'!H98","v":"ENGLAND (Veteran)"},null,"M5"]
[17,"David Busch",null,0,"-",5,null,"Vicenç Prats Salat"]
[18,"Günther Bamberzky",null,1,"-",0,null,"Juan Carlos Granados"]
[19,"Erich Hinkelmann",null,1,"-",1,null,"Ferran Coll"]
[20,"David Busch",null,0,"-",0,null,"Antonio Montano"]
["Sub"]
[]
["21 à 24",{"$f":"'Team Groups'!H88","v":"GREECE (Veteran)"},{"$f":"IF(D507>F507,1,0)+IF(D508>F508,1,0)+IF(D509>F509,1,0)+IF(D510>F510,1,0)","v":3},{"$f":"SUM(D507:D511)","v":10},"-",{"$f":"SUM(F507:F511)","v":6},{"$f":"IF(D507<F507,1,0)+IF(D508<F508,1,0)+IF(D509<F509,1,0)+IF(D510<F510,1,0)","v":1},{"$f":"'Team Groups'!H97","v":"GERMANY (Veteran)"},null,{"$f":"'Team Groups'!H89","v":"MALTA (Veteran)"},null,"M6"]
[21,"Nikos Naskos",null,3,"-",0,null,"Frank Stiller"]
[22,"Chris Aggelinas",null,4,"-",2,null,"Rainer Vogt"]
[23,"Dimitris Stamatopoulos",null,2,"-",1,null,"Frank Hagenkötter"]
[24,"Panagiotis Haratsis",null,1,"-",3,null,"Arnold Mair"]
["Sub"]
[]
[]
["25 à 28",{"$f":"'Team Groups'!E18","v":"FRANCE (Ladies)"},{"$f":"IF(D515>F515,1,0)+IF(D516>F516,1,0)+IF(D517>F517,1,0)+IF(D518>F518,1,0)","v":0},{"$f":"SUM(D515:D519)","v":5},"-",{"$f":"SUM(F515:F519)","v":13},{"$f":"IF(D515<F515,1,0)+IF(D516<F516,1,0)+IF(D517<F517,1,0)+IF(D518<F518,1,0)","v":3},{"$f":"'Team Groups'!B18","v":"ITALY (Ladies)"},null,{"$f":"'Team Groups'!H72","v":"GILBRALTAR (Open)"}]
[25,"Sylvie Guyot ",null,1,"-",6,null,"Giulia Brillantino"]
[26,"Arielle Briant",null,2,"-",2,null,"Giuditta Lo Cascio"]
[27,"Françoise Guyot",null,0,"-",2,null,"Eleonora Buttitta"]
[28,"Audrey Herbaut",null,2,"-",3,null,"Hélène Boniface"]
["Sub",null,null,null,null,null,null,"Paola Forlani"]
[]
["29 à 32",{"$f":"'Team Groups'!C18","v":"GERMANY (Ladies)"},{"$f":"IF(D522>F522,1,0)+IF(D523>F523,1,0)+IF(D524>F524,1,0)+IF(D525>F525,1,0)","v":0},{"$f":"SUM(D522:D526)","v":2},"-",{"$f":"SUM(F522:F526)","v":11},{"$f":"IF(D522<F522,1,0)+IF(D523<F523,1,0)+IF(D524<F524,1,0)+IF(D525<F525,1,0)","v":4},{"$f":"'Team Groups'!D18","v":"BELGIUM (Ladies)"},null,{"$f":"'Team Groups'!H63","v":"JAPAN (Open)"}]
[29,"Conny Vulpes",null,0,"-",4,null,"Margault Delval"]
[30,"Daria Prazynski",null,1,"-",2,null,"Elodie Bertholet"]
[31,"Maike Krause",null,0,"-",2,null,"Cynthia Bouchez"]
[32,"Victoria Büsing",null,1,"-",3,null,"Lydie Pinchart"]
["Sub"]
[]
["33 à 36",{"$f":"'Team Groups'!F29","v":"AUSTRIA  (U15)"},{"$f":"IF(D529>F529,1,0)+IF(D530>F530,1,0)+IF(D531>F531,1,0)+IF(D532>F532,1,0)","v":4},{"$f":"SUM(D529:D533)","v":15},"-",{"$f":"SUM(F529:F533)","v":1},{"$f":"IF(D529<F529,1,0)+IF(D530<F530,1,0)+IF(D531<F531,1,0)+IF(D532<F532,1,0)","v":0},{"$f":"'Team Groups'!C29","v":"ENGLAND (U15)"},null,{"$f":"'Team Groups'!H83","v":"FRANCE (Veteran)"}]
[33,"Jonathan Nichtenberger",null,4,"-",0,null,"Rhys Williams"]
[34,"Lukas Eppensteiner",null,3,"-",0,null,"Thomas Price"]
[35,"Daniel Vranowitz",null,3,"-",0,null,"Conor Atkin"]
[36,"Adam Kraus",null,5,"-",1,null,"Joshua Foreman"]
["Sub"]
[]
["37 à 40",{"$f":"'Team Groups'!E29","v":"SPAIN  (U15)"},{"$f":"IF(D536>F536,1,0)+IF(D537>F537,1,0)+IF(D538>F538,1,0)+IF(D539>F539,1,0)","v":1},{"$f":"SUM(D536:D540)","v":7},"-",{"$f":"SUM(F536:F540)","v":5},{"$f":"IF(D536<F536,1,0)+IF(D537<F537,1,0)+IF(D538<F538,1,0)+IF(D539<F539,1,0)","v":2},{"$f":"'Team Groups'!G29","v":"FRANCE (U15)"},null,{"$f":"'Team Groups'!H99","v":"USA (Veteran)"}]
[37,"Antonio Garcia Fernandez",null,6,"-",0,null,"Florentine Ausset"]
[38,"Jorge Pinero",null,1,"-",3,null,"Eliott Legall"]
[39,"Gonzalo Garcia- Guereta",null,0,"-",2,null,"Paul Offmann"]
[40,null,null,0,"-",0]
["Sub"]
[]
["41 à 44",{"$f":"'Team Groups'!B34","v":"ITALY (U12)"},{"$f":"IF(D543>F543,1,0)+IF(D544>F544,1,0)+IF(D545>F545,1,0)+IF(D546>F546,1,0)","v":2},{"$f":"SUM(D543:D547)","v":7},"-",{"$f":"SUM(F543:F547)","v":4},{"$f":"IF(D543<F543,1,0)+IF(D544<F544,1,0)+IF(D545<F545,1,0)+IF(D546<F546,1,0)","v":1},{"$f":"'Team Groups'!D34","v":"SPAIN  (U12)"},null,{"$f":"'Team Groups'!H54","v":"RUSSIA (Open)"}]
[41,"Mattia Ferrante",null,1,"-",2,null,"Kristian Sylagiev"]
[42,"Francesco Tozzi",null,4,"-",1,null,"Jesus Maireles"]
[43,"Riccardo Natoli",null,1,"-",0,null,"Paula Maireles"]
[44,"Francesco Tozzi",null,1,"-",1,null,"Carlos Pinto"]
["Sub"]
[]
["45 à 48",{"$f":"'Team Groups'!C34","v":"FRANCE (U12)"},{"$f":"IF(D550>F550,1,0)+IF(D551>F551,1,0)+IF(D552>F552,1,0)+IF(D553>F553,1,0)","v":1},{"$f":"SUM(D550:D554)","v":5},"-",{"$f":"SUM(F550:F554)","v":11},{"$f":"IF(D550<F550,1,0)+IF(D551<F551,1,0)+IF(D552<F552,1,0)+IF(D553<F553,1,0)","v":3},{"$f":"'Team Groups'!E34","v":"BELGIUM (U12)"},null,{"$f":"'Team Groups'!H90","v":"GILBRALTAR (Veteran)"}]
[45,"Louis Fouetillou",null,3,"-",2,null,"Jann Segers"]
[46,"Quentin Ausset",null,1,"-",2,null,"Basile Magermans"]
[47,"Victor Dubuc",null,1,"-",6,null,"Lucas Pere"]
[48,"Marc Offmann",null,0,"-",1,null,"Aurélien Feye"]
["Sub"]
[]
[]
[]
["Série 7 - 15h20"]
[]
["Tables"]
[null,null,null,null,null,null,null,null,null,"Referees"]
[]
["1/2 final open"]
[]
[null,"SPAIN (Open)",{"$f":"IF(D566>F566,1,0)+IF(D567>F567,1,0)+IF(D568>F568,1,0)+IF(D569>F569,1,0)","v":2},{"$f":"SUM(D566:D569)","v":9},"-",{"$f":"SUM(F566:F569)","v":4},{"$f":"IF(D566<F566,1,0)+IF(D567<F567,1,0)+IF(D568<F568,1,0)+IF(D569<F569,1,0)","v":2},"GREECE (Open)",null,"FRANCE (Open)",null,"M7"]
[1,"Juan Manuel Noguera",null,4,"-",0,null,"Lazaros Papakonstantinou"]
[2,"Antonio Casin",null,1,"-",2,null,"Spyros Hantzaras"]
[3,"Carlos Flores",null,4,"-",0,null,"Velissarios Fragakis"]
[4,"David Gonzalez",null,0,"-",2,null,"Giorgos Koutis"]
["Sub",null,null,null,null,null,null,"Spyros Patrinos"]
[]
["5 à 8","ITALY (Open)",{"$f":"IF(D573>F573,1,0)+IF(D574>F574,1,0)+IF(D575>F575,1,0)+IF(D576>F576,1,0)","v":3},{"$f":"SUM(D573:D577)","v":15},"-",{"$f":"SUM(F573:F577)","v":8},{"$f":"IF(D573<F573,1,0)+IF(D574<F574,1,0)+IF(D575<F575,1,0)+IF(D576<F576,1,0)","v":1},"AUSTRIA (Open)",null,"BELGIUM (Open)",null,"M8"]
[5,"Massimiliano Nastasi",null,3,"-",2,null,"Alexander Haas"]
[6,"Luca Colangelo",null,3,"-",1,null,"Wolfgang Leitner"]
[7,"Saverio Bari",null,2,"-",3,null,"Christian Haas"]
[8,"Luca Zambello",null,7,"-",2,null,"Wolfgang Haas"]
["Sub","Daniele Bertelli"]
[]
[]
["1/2 final veteran"]
[]
["9 à 12",{"$f":"'Team Groups'!H81","v":"BELGIUM (Veteran)"},{"$f":"IF(D583>F583,1,0)+IF(D584>F584,1,0)+IF(D585>F585,1,0)+IF(D586>F586,1,0)","v":2},{"$f":"SUM(D583:D587)","v":6},"-",{"$f":"SUM(F583:F587)","v":4},{"$f":"IF(D583<F583,1,0)+IF(D584<F584,1,0)+IF(D585<F585,1,0)+IF(D586<F586,1,0)","v":1},"GREECE (Veteran)",null,"GERMANY (Open)",null,"M9"]
[9,"Eric  Threis",null,2,"-",1,null,"Dimitris Stamatopoulos"]
[10,"Alain Jadot",null,0,"-",1,null,"Nikos Naskos"]
[11,"Pascal Scheen",null,1,"-",1,null,"Chris Aggelinas"]
[12,"Daniel Scheen",null,3,"-",1,null,"Panagiotis Haratsis"]
["Sub","Benoît Massart",null,null,null,null,null,"Giorgos Aggelinas"]
[]
["13 à 16","SPAIN (Veteran)",{"$f":"IF(D590>F590,1,0)+IF(D591>F591,1,0)+IF(D592>F592,1,0)+IF(D593>F593,1,0)","v":0},{"$f":"SUM(D590:D594)","v":2},"-",{"$f":"SUM(F590:F594)","v":11},{"$f":"IF(D590<F590,1,0)+IF(D591<F591,1,0)+IF(D592<F592,1,0)+IF(D593<F593,1,0)","v":4},{"$f":"'Team Groups'!H87","v":"ITALY (Veteran)"},null,"AUSTRIA (Veteran)",null,"M10"]
[13,"Antonio Montano",null,0,"-",2,null,"Patrizio Lazzaretti"]
[14,"Vicenç Prats Salat",null,1,"-",2,null,"Gianfranco Calonico"]
[15,"Ferran Coll",null,1,"-",5,null,"Stefano De Francesco"]
[16,"Luis Lopez ",null,0,"-",2,null,"Francesco Mattiangeli"]
["Sub"]
[]
[]
["1/2 final U19"]
[]
["17 à 20",{"$f":"'Team Groups'!H120","v":"ITALY (U19)"},{"$f":"IF(D600>F600,1,0)+IF(D601>F601,1,0)+IF(D602>F602,1,0)+IF(D603>F603,1,0)","v":1},{"$f":"SUM(D600:D604)","v":9},"-",{"$f":"SUM(F600:F604)","v":7},{"$f":"IF(D600<F600,1,0)+IF(D601<F601,1,0)+IF(D602<F602,1,0)+IF(D603<F603,1,0)","v":2},{"$f":"'Team Groups'!H127","v":"GERMANY (U19)"},null,"NETHERLAND (Open)",null,"M11"]
[17,"Nicola Borgo",null,3,"-",3,null,"Moritz Jung"]
[18,"Andrea Ciccarelli",null,1,"-",2,null,"Kai Hagenkötter"]
[19,"Paolo Zambello",null,0,"-",1,null,"Alwin Krause "]
[20,"Marco Di Vito",null,5,"-",1,null,"Fabio Bianco"]
["Sub"]
[]
["21 à 24",{"$f":"'Team Groups'!H121","v":"ENGLAND (U19)"},{"$f":"IF(D607>F607,1,0)+IF(D608>F608,1,0)+IF(D609>F609,1,0)+IF(D610>F610,1,0)","v":0},{"$f":"SUM(D607:D611)","v":5},"-",{"$f":"SUM(F607:F611)","v":17},{"$f":"IF(D607<F607,1,0)+IF(D608<F608,1,0)+IF(D609<F609,1,0)+IF(D610<F610,1,0)","v":4},{"$f":"'Team Groups'!H126","v":"BELGIUM (U19)"},null,"GERMANY (Veteran)",null,"M12"]
[21,"Chris Bowen",null,0,"-",4,null,"Nathan Dizier"]
[22,"Elliott Bellefontaine",null,3,"-",4,null,"Florian Giaux"]
[23,"Kye Arnold",null,2,"-",5,null,"Steffen Despretz"]
[24,"Connor Bowden",null,0,"-",4,null,"Martin Antoine"]
["Sub"]
[]
[]
["25 à 28",{"$f":"'Team Groups'!B29","v":"ITALY (U15)"},{"$f":"IF(D615>F615,1,0)+IF(D616>F616,1,0)+IF(D617>F617,1,0)+IF(D618>F618,1,0)","v":3},{"$f":"SUM(D615:D619)","v":17},"-",{"$f":"SUM(F615:F619)","v":11},{"$f":"IF(D615<F615,1,0)+IF(D616<F616,1,0)+IF(D617<F617,1,0)+IF(D618<F618,1,0)","v":1},{"$f":"'Team Groups'!F29","v":"AUSTRIA  (U15)"},null,{"$f":"'Team Groups'!J128","v":"PORTUGAL (U19)"}]
[25,"Riccardo Lazzari",null,4,"-",2,null,"Lukas Eppensteiner"]
[26,"Andrea Bolognino",null,3,"-",7,null,"Marios Strommer"]
[27,"Claudio La Torre",null,5,"-",1,null,"Jonathan Nichtenberger"]
[28,"Antonio La Torre",null,5,"-",1,null,"Daniel Vranowitz"]
["Sub"]
[]
["29 à 32",{"$f":"'Team Groups'!C29","v":"ENGLAND (U15)"},{"$f":"IF(D622>F622,1,0)+IF(D623>F623,1,0)+IF(D624>F624,1,0)+IF(D625>F625,1,0)","v":3},{"$f":"SUM(D622:D626)","v":10},"-",{"$f":"SUM(F622:F626)","v":5},{"$f":"IF(D622<F622,1,0)+IF(D623<F623,1,0)+IF(D624<F624,1,0)+IF(D625<F625,1,0)","v":1},{"$f":"'Team Groups'!E29","v":"SPAIN  (U15)"},null,{"$f":"'Team Groups'!B18","v":"ITALY (Ladies)"}]
[29,"Conor Atkin",null,1,"-",5,null,"Antonio Garcia Fernandez"]
[30,"Rhys Williams",null,4,"-",0,null,"Jorge Pinero"]
[31,"Thomas Price",null,2,"-",0,null,"Gonzalo Garcia- Guereta"]
[32,"Joshua Foreman",null,3,"-",0,"ff"]
["Sub"]
[]
["33 à 36",{"$f":"'Team Groups'!G29","v":"FRANCE (U15)"},{"$f":"IF(D629>F629,1,0)+IF(D630>F630,1,0)+IF(D631>F631,1,0)+IF(D632>F632,1,0)","v":0},{"$f":"SUM(D629:D633)","v":2},"-",{"$f":"SUM(F629:F633)","v":15},{"$f":"IF(D629<F629,1,0)+IF(D630<F630,1,0)+IF(D631<F631,1,0)+IF(D632<F632,1,0)","v":4},{"$f":"'Team Groups'!D29","v":"BELGIUM (U15)"},null,{"$f":"'Team Groups'!C18","v":"GERMANY (Ladies)"}]
[33,"Paul Offmann",null,0,"-",5,null,"Corentin Boltz"]
[34,"Eliott Legall",null,2,"-",5,null,"Maxime Rairoux"]
[35,"Florentine Ausset",null,0,"-",2,null,"Mathéo Grégoire"]
[36,null,"ff",0,"-",3,null,"Louison Giaux"]
["Sub"]
[]
["37 à 40",{"$f":"'Team Groups'!E34","v":"BELGIUM (U12)"},{"$f":"IF(D636>F636,1,0)+IF(D637>F637,1,0)+IF(D638>F638,1,0)+IF(D639>F639,1,0)","v":0},{"$f":"SUM(D636:D640)","v":1},"-",{"$f":"SUM(F636:F640)","v":22},{"$f":"IF(D636<F636,1,0)+IF(D637<F637,1,0)+IF(D638<F638,1,0)+IF(D639<F639,1,0)","v":4},{"$f":"'Team Groups'!B34","v":"ITALY (U12)"},null,{"$f":"'Team Groups'!E18","v":"FRANCE (Ladies)"}]
[37,"Aurélien Feye",null,0,"-",4,null,"Matteo Cammarata"]
[38,"Noah Denne",null,0,"-",7,null,"Francesco Tozzi"]
[39,"Jann Segers",null,1,"-",4,null,"Cristian Fricano"]
[40,"Alex Genart",null,0,"-",7,null,"Mattia Ferrante"]
["Sub","Basile Magermans",null,null,null,null,null,"Giorgio Giudice"]
[]
["41 à 44",{"$f":"'Team Groups'!C34","v":"FRANCE (U12)"},{"$f":"IF(D643>F643,1,0)+IF(D644>F644,1,0)+IF(D645>F645,1,0)+IF(D646>F646,1,0)","v":2},{"$f":"SUM(D643:D647)","v":8},"-",{"$f":"SUM(F643:F647)","v":7},{"$f":"IF(D643<F643,1,0)+IF(D644<F644,1,0)+IF(D645<F645,1,0)+IF(D646<F646,1,0)","v":2},{"$f":"'Team Groups'!D34","v":"SPAIN  (U12)"},null,{"$f":"'Team Groups'!D18","v":"BELGIUM (Ladies)"}]
[41,"Quentin Ausset",null,2,"-",1,null,"Jesus Maireles"]
[42,"Louis Fouetillou",null,3,"-",0,null,"Paula Maireles"]
[43,"Victor Dubuc",null,1,"-",3,null,"Kristian Sylagiev"]
[44,"Marc Offmann",null,2,"-",3,null,"Carlos Pinto"]
["Sub"]
[]
["45 à 48"]
[]
[]
["Série 8 - 16h30"]
[]
["Tables"]
[null,null,null,null,null,null,null,null,null,"Referees"]
[]
["Final open"]
[]
["1 à 4","SPAIN (Open)",{"$f":"IF(D660>F660,1,0)+IF(D661>F661,1,0)+IF(D662>F662,1,0)+IF(D663>F663,1,0)","v":0},{"$f":"SUM(D660:D664)","v":6},"-",{"$f":"SUM(F660:F664)","v":14},{"$f":"IF(D660<F660,1,0)+IF(D661<F661,1,0)+IF(D662<F662,1,0)+IF(D663<F663,1,0)","v":4},"ITALY (Open)",null,{"$f":"H565","v":"GREECE (Open)"}]
[1,"Antonio Casin",null,0,"-",3,null,"Luca Zambello"]
[2,"Juan Manuel Noguera",null,2,"-",5,null,"Daniele Bertelli"]
[3,"Carlos Flores",null,2,"-",3,null,"Saverio Bari"]
[4,"David Gonzalez",null,2,"-",3,null,"Luca Colangelo"]
["Sub",null,null,null,null,null,null,"Massimiliano Nastasi"]
[]
[]
["Final veteran"]
[]
["5 à 8","BELGIUM (Veteran)",{"$f":"IF(D670>F670,1,0)+IF(D671>F671,1,0)+IF(D672>F672,1,0)+IF(D673>F673,1,0)","v":1},{"$f":"SUM(D670:D674)","v":7},"-",{"$f":"SUM(F670:F674)","v":10},{"$f":"IF(D670<F670,1,0)+IF(D671<F671,1,0)+IF(D672<F672,1,0)+IF(D673<F673,1,0)","v":3},"ITALY (Veteran)",null,{"$f":"H572","v":"AUSTRIA (Open)"}]
[5,"Eric  Threis",null,4,"-",3,null,"Gianfranco Calonico"]
[6,"Pascal Scheen",null,2,"-",3,null,"Patrizio Lazzaretti"]
[7,"Benoît Massart",null,1,"-",2,null,"Stefano De Francesco"]
[8,"Daniel Scheen",null,0,"-",2,null,"Francesco Mattiangeli"]
["Sub",null,null,null,null,null,null,"Mario Corradi"]
[]
[]
["Final ladies"]
[]
["9 à 12",{"$f":"'Team Groups'!H108","v":"BELGIUM (Ladies)"},{"$f":"IF(D680>F680,1,0)+IF(D681>F681,1,0)+IF(D682>F682,1,0)+IF(D683>F683,1,0)","v":2},{"$f":"SUM(D680:D684)","v":6},"-",{"$f":"SUM(F680:F684)","v":5},{"$f":"IF(D680<F680,1,0)+IF(D681<F681,1,0)+IF(D682<F682,1,0)+IF(D683<F683,1,0)","v":2},{"$f":"'Team Groups'!H109","v":"ITALY (Ladies)"},null,{"$f":"H582","v":"GREECE (Veteran)"}]
[9,"Emilie Despretz",null,1,"-",0,null,"Paola Forlani"]
[10,"Cynthia Bouchez",null,0,"-",2,null,"Eleonora Buttitta"]
[11,"Lydie Pinchart",null,1,"-",3,null,"Giuditta Lo Cascio"]
[12,"Delphine Dieudonné",null,4,"-",0,null,"Hélène Boniface"]
["Sub"]
[]
[]
["Final U19"]
[]
["13 à 16","GERMANY (U19)",{"$f":"IF(D690>F690,1,0)+IF(D691>F691,1,0)+IF(D692>F692,1,0)+IF(D693>F693,1,0)","v":1},{"$f":"SUM(D690:D694)","v":7},"-",{"$f":"SUM(F690:F694)","v":8},{"$f":"IF(D690<F690,1,0)+IF(D691<F691,1,0)+IF(D692<F692,1,0)+IF(D693<F693,1,0)","v":2},"BELGIUM (U19)",null,{"$f":"B599","v":"ITALY (U19)"}]
[13,"Moritz Jung",null,1,"-",1,null,"Nathan Dizier"]
[14,"Kai Hagenkötter",null,1,"-",0,null,"William Van den Houte"]
[15,"Alwin Krause ",null,2,"-",3,null,"Steffen Despretz"]
[16,"Fabio Bianco",null,3,"-",4,null,"Florian Giaux"]
["Sub"]
[]
[]
["Final U15"]
[]
["17 à 20",{"$f":"'Team Groups'!H138","v":"ITALY (U15)"},{"$f":"IF(D700>F700,1,0)+IF(D701>F701,1,0)+IF(D702>F702,1,0)+IF(D703>F703,1,0)","v":3},{"$f":"SUM(D700:D704)","v":14},"-",{"$f":"SUM(F700:F704)","v":2},{"$f":"IF(D700<F700,1,0)+IF(D701<F701,1,0)+IF(D702<F702,1,0)+IF(D703<F703,1,0)","v":0},{"$f":"'Team Groups'!H139","v":"AUSTRIA  (U15)"},null,{"$f":"B589","v":"SPAIN (Veteran)"}]
[17,"Antonio La Torre",null,5,"-",0,null,"Jonathan Nichtenberger"]
[18,"Leonardo Giudice",null,4,"-",1,null,"Marios Strommer"]
[19,"Matteo Brillantino",null,1,"-",1,null,"Daniel Vranowitz"]
[20,"Claudio La Torre",null,4,"-",0,null,"Lukas Eppensteiner"]
["Sub"]
[]
[]
["Final U12"]
[]
["21 à 24",{"$f":"'Team Groups'!H159","v":"ITALY (U12)"},{"$f":"IF(D710>F710,1,0)+IF(D711>F711,1,0)+IF(D712>F712,1,0)+IF(D713>F713,1,0)","v":3},{"$f":"SUM(D710:D714)","v":12},"-",{"$f":"SUM(F710:F714)","v":2},{"$f":"IF(D710<F710,1,0)+IF(D711<F711,1,0)+IF(D712<F712,1,0)+IF(D713<F713,1,0)","v":0},{"$f":"'Team Groups'!H160","v":"BELGIUM (U12)"},null,{"$f":"B606","v":"ENGLAND (U19)"}]
[21,"Matteo Cammarata",null,7,"-",0,null,"Aurélien Feye"]
[22,"Riccardo Natoli",null,2,"-",1,null,"Lucas Pere"]
[23,"Cristian Fricano",null,2,"-",0,null,"Jann Segers"]
[24,"Giorgio Giudice",null,1,"-",1,null,"Basile Magermans"]
["Sub"]

{"sheet":"Feuil1","index":4,"n_rows":12,"n_cols":4,"rows_kept":12,"cut":false,"hidden":false,"merged":[]}
[]
["ITALY (Open)","SPAIN (Open)","AUSTRIA (Open)","GREECE (Open)"]
[]
["ITALY (Veteran)","BELGIUM (Veteran)","GREECE (Veteran)","SPAIN (Veteran)"]
[]
["BELGIUM (Ladies)","ITALY (Ladies)","FRANCE (Ladies)","GERMANY (Ladies)"]
[]
["BELGIUM (U19)","GERMANY (U19)","ITALY (U19)","ENGLAND (U19)"]
[]
["ITALY (U15)","AUSTRIA  (U15)","BELGIUM (U15)","ENGLAND (U15)"]
[]
["ITALY (U12)","BELGIUM (U12)","SPAIN  (U12)","FRANCE (U12)"]

{"sheet":"Séries équipes","index":5,"n_rows":176,"n_cols":6,"rows_kept":176,"cut":false,"hidden":false,"merged":[]}
["Série 1 - 9h00"]
[]
["Tables"]
[null,null,null,"Referees"]
[]
["1 à 4",{"$f":"'Team Groups'!B4","v":"AUSTRIA (Open)"},{"$f":"'Team Groups'!C4","v":"SCOTLAND (Open)"},"PORTUGAL (Open)"]
["5 à 8",{"$f":"'Team Groups'!D4","v":"GREECE (Open)"},{"$f":"'Team Groups'!E4","v":"RUSSIA (Open)"},"BELGIUM (Open)"]
["9 à 12",{"$f":"'Team Groups'!B5","v":"ITALY (Open)"},{"$f":"'Team Groups'!C5","v":"JAPAN (Open)"},"FRANCE (Open)"]
["13 à 16",{"$f":"'Team Groups'!D5","v":"NETHERLAND (Open)"},{"$f":"'Team Groups'!E5","v":"ENGLAND (Open)"},"GILBRALTAR (Open)"]
["17 à 20",{"$f":"'Team Groups'!B12","v":"ITALY (Veteran)"},{"$f":"'Team Groups'!C12","v":"GREECE (Veteran)"},"SPAIN (Open)"]
["21 à 24",{"$f":"'Team Groups'!D12","v":"GILBRALTAR (Veteran)"},{"$f":"'Team Groups'!E12","v":"MALTA (Veteran)"},"USA (Open)"]
["25 à 28",{"$f":"'Team Groups'!B13","v":"AUSTRIA (Veteran)"},{"$f":"'Team Groups'!C13","v":"ENGLAND (Veteran)"},"GERMANY (Open)"]
["29 à 32",{"$f":"'Team Groups'!D13","v":"GERMANY (Veteran)"},{"$f":"'Team Groups'!E13","v":"USA (Veteran)"},"SPAIN (Veteran)"]
["33 à 36",{"$f":"'Team Groups'!B23","v":"ITALY (U19)"},{"$f":"'Team Groups'!D23","v":"MALTA (U19)"},"BELGIUM (Veteran)"]
["37 à 40",{"$f":"'Team Groups'!B29","v":"ITALY (U15)"},{"$f":"'Team Groups'!C29","v":"ENGLAND (U15)"},"FRANCE (Veteran)"]
["41 à 44",{"$f":"'Team Groups'!D29","v":"BELGIUM (U15)"},{"$f":"'Team Groups'!E29","v":"SPAIN  (U15)"},"PORTUGAL (U19)"]
["45 à 48"]
[]
[]
["Série 2 - 10h00"]
[]
["Tables"]
[null,null,null,"Referees"]
[]
["1 à 4",{"$f":"'Team Groups'!B3","v":"SPAIN (Open)"},{"$f":"'Team Groups'!D3","v":"USA (Open)"},"NETHERLAND (Open)"]
["5 à 8",{"$f":"'Team Groups'!B6","v":"BELGIUM (Open)"},{"$f":"'Team Groups'!C6","v":"FRANCE (Open)"},"ITALY (Open)"]
["9 à 12",{"$f":"'Team Groups'!D6","v":"PORTUGAL (Open)"},{"$f":"'Team Groups'!E6","v":"GILBRALTAR (Open)"},"ENGLAND (Open)"]
["13 à 16",{"$f":"'Team Groups'!B4","v":"AUSTRIA (Open)"},{"$f":"'Team Groups'!D4","v":"GREECE (Open)"},"GERMANY (Veteran)"]
["17 à 20",{"$f":"'Team Groups'!C4","v":"SCOTLAND (Open)"},{"$f":"'Team Groups'!E4","v":"RUSSIA (Open)"},"JAPAN (Open)"]
["21 à 24",{"$f":"'Team Groups'!B11","v":"SPAIN (Veteran)"},{"$f":"'Team Groups'!D11","v":"BELGIUM (Veteran)"},"AUSTRIA (Veteran)"]
["25 à 28",{"$f":"'Team Groups'!B12","v":"ITALY (Veteran)"},{"$f":"'Team Groups'!D12","v":"GILBRALTAR (Veteran)"},"USA (Veteran)"]
["29 à 32",{"$f":"'Team Groups'!C12","v":"GREECE (Veteran)"},{"$f":"'Team Groups'!E12","v":"MALTA (Veteran)"},"ENGLAND (Veteran)"]
["33 à 36",{"$f":"'Team Groups'!B24","v":"BELGIUM (U19)"},{"$f":"'Team Groups'!C24","v":"GERMANY (U19)"},"ITALY (Ladies)"]
["37 à 40",{"$f":"'Team Groups'!D24","v":"PORTUGAL (U19)"},{"$f":"'Team Groups'!E24","v":"FRANCE (U19)"},"GERMANY (Ladies)"]
["41 à 44",{"$f":"'Team Groups'!F29","v":"AUSTRIA  (U15)"},{"$f":"'Team Groups'!G29","v":"FRANCE (U15)"},"ITALY (U19)"]
["45 à 48",{"$f":"'Team Groups'!E29","v":"SPAIN  (U15)"},{"$f":"'Team Groups'!B29","v":"ITALY (U15)"},"MALTA (U19)"]
[]
[]
["Série 3 - 11h00"]
[]
["Tables"]
[null,null,null,"Referees"]
[]
["1 à 4",{"$f":"'Team Groups'!D3","v":"USA (Open)"},{"$f":"'Team Groups'!C3","v":"GERMANY (Open)"},"GREECE (Open)"]
["5 à 8",{"$f":"'Team Groups'!B5","v":"ITALY (Open)"},{"$f":"'Team Groups'!D5","v":"NETHERLAND (Open)"},"AUSTRIA (Open)"]
["9 à 12",{"$f":"'Team Groups'!C5","v":"JAPAN (Open)"},{"$f":"'Team Groups'!E5","v":"ENGLAND (Open)"},"RUSSIA (Open)"]
["13 à 16",{"$f":"'Team Groups'!B6","v":"BELGIUM (Open)"},{"$f":"'Team Groups'!D6","v":"PORTUGAL (Open)"},"GILBRALTAR (Veteran)"]
["17 à 20",{"$f":"'Team Groups'!C6","v":"FRANCE (Open)"},{"$f":"'Team Groups'!E6","v":"GILBRALTAR (Open)"},"SCOTLAND (Open)"]
["21 à 24",{"$f":"'Team Groups'!D11","v":"BELGIUM (Veteran)"},{"$f":"'Team Groups'!C11","v":"FRANCE (Veteran)"},"ITALY (Veteran)"]
["25 à 28",{"$f":"'Team Groups'!B13","v":"AUSTRIA (Veteran)"},{"$f":"'Team Groups'!D13","v":"GERMANY (Veteran)"},"GREECE (Veteran)"]
["29 à 32",{"$f":"'Team Groups'!C13","v":"ENGLAND (Veteran)"},{"$f":"'Team Groups'!E13","v":"USA (Veteran)"},"MALTA (Veteran)"]
["33 à 36",{"$f":"'Team Groups'!B18","v":"ITALY (Ladies)"},{"$f":"'Team Groups'!C18","v":"GERMANY (Ladies)"},"BELGIUM (U19)"]
["37 à 40",{"$f":"'Team Groups'!D18","v":"BELGIUM (Ladies)"},{"$f":"'Team Groups'!E18","v":"FRANCE (Ladies)"},"PORTUGAL (U19)"]
["41 à 44",{"$f":"'Team Groups'!D23","v":"MALTA (U19)"},{"$f":"'Team Groups'!C23","v":"ENGLAND (U19)"},"SPAIN (Veteran)"]
["45 à 48",{"$f":"'Team Groups'!C29","v":"ENGLAND (U15)"},{"$f":"'Team Groups'!G29","v":"FRANCE (U15)"},"GERMANY (U19)"]
["49 à 52",{"$f":"'Team Groups'!D29","v":"BELGIUM (U15)"},{"$f":"'Team Groups'!F29","v":"AUSTRIA  (U15)"},"FRANCE (U19)"]
[]
["Série 4 - 12h00"]
[]
["Tables"]
[null,null,null,"Referees"]
[]
["1 à 4",{"$f":"'Team Groups'!E4","v":"RUSSIA (Open)"},{"$f":"'Team Groups'!B4","v":"AUSTRIA (Open)"},"FRANCE (Open)"]
["5 à 8",{"$f":"'Team Groups'!C4","v":"SCOTLAND (Open)"},{"$f":"'Team Groups'!D4","v":"GREECE (Open)"},"GILBRALTAR (Open)"]
["9 à 12",{"$f":"'Team Groups'!E5","v":"ENGLAND (Open)"},{"$f":"'Team Groups'!B5","v":"ITALY (Open)"},"PORTUGAL (Open)"]
["13 à 16",{"$f":"'Team Groups'!C5","v":"JAPAN (Open)"},{"$f":"'Team Groups'!D5","v":"NETHERLAND (Open)"},"BELGIUM (Open)"]
["17 à 20",{"$f":"'Team Groups'!C11","v":"FRANCE (Veteran)"},{"$f":"'Team Groups'!B11","v":"SPAIN (Veteran)"},"GERMANY (Veteran)"]
["21 à 24",{"$f":"'Team Groups'!E12","v":"MALTA (Veteran)"},{"$f":"'Team Groups'!B12","v":"ITALY (Veteran)"},"AUSTRIA (Veteran)"]
["25 à 28",{"$f":"'Team Groups'!C12","v":"GREECE (Veteran)"},{"$f":"'Team Groups'!D12","v":"GILBRALTAR (Veteran)"},"ENGLAND (Veteran)"]
["29 à 32",{"$f":"'Team Groups'!B18","v":"ITALY (Ladies)"},{"$f":"'Team Groups'!D18","v":"BELGIUM (Ladies)"},"USA (Veteran)"]
["33 à 36",{"$f":"'Team Groups'!C18","v":"GERMANY (Ladies)"},{"$f":"'Team Groups'!E18","v":"FRANCE (Ladies)"},"SPAIN (Open)"]
["37 à 40",{"$f":"'Team Groups'!B24","v":"BELGIUM (U19)"},{"$f":"'Team Groups'!D24","v":"PORTUGAL (U19)"},"GERMANY (Open)"]
["41 à 44",{"$f":"'Team Groups'!C24","v":"GERMANY (U19)"},{"$f":"'Team Groups'!E24","v":"FRANCE (U19)"},"BELGIUM (Veteran)"]
["45 à 48",{"$f":"'Team Groups'!G29","v":"FRANCE (U15)"},{"$f":"'Team Groups'!B29","v":"ITALY (U15)"},"ENGLAND (U19)"]
["49 à 52",{"$f":"'Team Groups'!C29","v":"ENGLAND (U15)"},{"$f":"'Team Groups'!D29","v":"BELGIUM (U15)"},"USA (Open)"]
[]
["Série 5 - 13h00"]
[]
["Tables"]
[null,null,null,"Referees"]
[]
["1 à 4",{"$f":"'Team Groups'!C3","v":"GERMANY (Open)"},{"$f":"'Team Groups'!B3","v":"SPAIN (Open)"},"SCOTLAND (Open)"]
["5 à 8",{"$f":"'Team Groups'!E6","v":"GILBRALTAR (Open)"},{"$f":"'Team Groups'!B6","v":"BELGIUM (Open)"},"JAPAN (Open)"]
["9 à 12",{"$f":"'Team Groups'!C6","v":"FRANCE (Open)"},{"$f":"'Team Groups'!D6","v":"PORTUGAL (Open)"},"GREECE (Open)"]
["13 à 16",{"$f":"'Team Groups'!E13","v":"USA (Veteran)"},{"$f":"'Team Groups'!B13","v":"AUSTRIA (Veteran)"},"NETHERLAND (Open)"]
["17 à 20",{"$f":"'Team Groups'!C13","v":"ENGLAND (Veteran)"},{"$f":"'Team Groups'!D13","v":"GERMANY (Veteran)"},"ITALY (Open)"]
["21 à 24",{"$f":"'Team Groups'!C23","v":"ENGLAND (U19)"},{"$f":"'Team Groups'!B23","v":"ITALY (U19)"},"RUSSIA (Open)"]
["25 à 28",{"$f":"'Team Groups'!E24","v":"FRANCE (U19)"},{"$f":"'Team Groups'!B24","v":"BELGIUM (U19)"},"AUSTRIA (Open)"]
["29 à 32",{"$f":"'Team Groups'!C24","v":"GERMANY (U19)"},{"$f":"'Team Groups'!D24","v":"PORTUGAL (U19)"},"ENGLAND (Open)"]
["33 à 36",{"$f":"'Team Groups'!F29","v":"AUSTRIA  (U15)"},{"$f":"'Team Groups'!E29","v":"SPAIN  (U15)"},"GILBRALTAR (Veteran)"]
["37 à 40",{"$f":"'Team Groups'!B29","v":"ITALY (U15)"},{"$f":"'Team Groups'!D29","v":"BELGIUM (U15)"},"MALTA (Veteran)"]
["41 à 44",{"$f":"'Team Groups'!B34","v":"ITALY (U12)"},{"$f":"'Team Groups'!C34","v":"FRANCE (U12)"},"GREECE (Veteran)"]
["45 à 48",{"$f":"'Team Groups'!D34","v":"SPAIN  (U12)"},{"$f":"'Team Groups'!E34","v":"BELGIUM (U12)"},"ITALY (Veteran)"]
[]
[]
["Série 6 - 14h10"]
[]
["Tables"]
[null,null,null,"Referees"]
[]
["1/4 final open"]
[]
["1 à 4",{"$f":"'Team Groups'!H45","v":"SPAIN (Open)"},{"$f":"'Team Groups'!H61","v":"NETHERLAND (Open)"},{"$f":"'Team Groups'!H53","v":"SCOTLAND (Open)"},null,"M1"]
["5 à 8",{"$f":"'Team Groups'!H52","v":"GREECE (Open)"},{"$f":"'Team Groups'!H69","v":"BELGIUM (Open)"},{"$f":"'Team Groups'!H62","v":"ENGLAND (Open)"},null,"M2"]
["9 à 12",{"$f":"'Team Groups'!H60","v":"ITALY (Open)"},{"$f":"'Team Groups'!H46","v":"GERMANY (Open)"},{"$f":"'Team Groups'!H71","v":"PORTUGAL (Open)"},null,"M3"]
["13 à 16",{"$f":"'Team Groups'!H70","v":"FRANCE (Open)"},{"$f":"'Team Groups'!H51","v":"AUSTRIA (Open)"},{"$f":"'Team Groups'!H47","v":"USA (Open)"},null,"M4"]
[]
["Barrages veteran"]
[]
["17 à 20",{"$f":"'Team Groups'!H96","v":"AUSTRIA (Veteran)"},{"$f":"'Team Groups'!H82","v":"SPAIN (Veteran)"},{"$f":"'Team Groups'!H98","v":"ENGLAND (Veteran)"},null,"M5"]
["21 à 24",{"$f":"'Team Groups'!H88","v":"GREECE (Veteran)"},{"$f":"'Team Groups'!H97","v":"GERMANY (Veteran)"},{"$f":"'Team Groups'!H89","v":"MALTA (Veteran)"},null,"M6"]
[]
["25 à 28",{"$f":"'Team Groups'!E18","v":"FRANCE (Ladies)"},{"$f":"'Team Groups'!B18","v":"ITALY (Ladies)"},{"$f":"'Team Groups'!H72","v":"GILBRALTAR (Open)"}]
["29 à 32",{"$f":"'Team Groups'!C18","v":"GERMANY (Ladies)"},{"$f":"'Team Groups'!D18","v":"BELGIUM (Ladies)"},{"$f":"'Team Groups'!H63","v":"JAPAN (Open)"}]
["33 à 36",{"$f":"'Team Groups'!F29","v":"AUSTRIA  (U15)"},{"$f":"'Team Groups'!C29","v":"ENGLAND (U15)"},{"$f":"'Team Groups'!H83","v":"FRANCE (Veteran)"}]
["37 à 40",{"$f":"'Team Groups'!E29","v":"SPAIN  (U15)"},{"$f":"'Team Groups'!G29","v":"FRANCE (U15)"},{"$f":"'Team Groups'!H99","v":"USA (Veteran)"}]
["41 à 44",{"$f":"'Team Groups'!B34","v":"ITALY (U12)"},{"$f":"'Team Groups'!D34","v":"SPAIN  (U12)"},{"$f":"'Team Groups'!H54","v":"RUSSIA (Open)"}]
["45 à 48",{"$f":"'Team Groups'!C34","v":"FRANCE (U12)"},{"$f":"'Team Groups'!E34","v":"BELGIUM (U12)"},{"$f":"'Team Groups'!H90","v":"GILBRALTAR (Veteran)"}]
[]
[]
["Série 7 - 15h20"]
[]
["Tables"]
[null,null,null,"Referees"]
[]
["1/2 final open"]
[]
["1 à 4",{"$f":"'Séries équipes full'!B565","v":"SPAIN (Open)"},{"$f":"'Séries équipes full'!H565","v":"GREECE (Open)"},{"$f":"'Séries équipes full'!#REF!","v":{"$error":"#REF!"}},null,"M7"]
["5 à 8",{"$f":"'Séries équipes full'!B572","v":"ITALY (Open)"},{"$f":"'Séries équipes full'!H572","v":"AUSTRIA (Open)"},{"$f":"'Séries équipes full'!#REF!","v":{"$error":"#REF!"}},null,"M8"]
[]
["1/2 final veteran"]
[]
["9 à 12",{"$f":"'Team Groups'!H81","v":"BELGIUM (Veteran)"},{"$f":"'Séries équipes full'!H582","v":"GREECE (Veteran)"},{"$f":"'Séries équipes full'!J582","v":"GERMANY (Open)"},null,"M9"]
["13 à 16",{"$f":"'Séries équipes full'!B589","v":"SPAIN (Veteran)"},{"$f":"'Team Groups'!H87","v":"ITALY (Veteran)"},{"$f":"'Séries équipes full'!J599","v":"NETHERLAND (Open)"},null,"M10"]
[]
["1/2 final U19"]
[]
["17 à 20",{"$f":"'Team Groups'!H120","v":"ITALY (U19)"},{"$f":"'Team Groups'!H127","v":"GERMANY (U19)"},{"$f":"'Séries équipes full'!#REF!","v":{"$error":"#REF!"}},null,"M11"]
["21 à 24",{"$f":"'Team Groups'!H121","v":"ENGLAND (U19)"},{"$f":"'Team Groups'!H126","v":"BELGIUM (U19)"},{"$f":"'Séries équipes full'!#REF!","v":{"$error":"#REF!"}},null,"M12"]
[]
["25 à 28",{"$f":"'Team Groups'!B29","v":"ITALY (U15)"},{"$f":"'Team Groups'!F29","v":"AUSTRIA  (U15)"},{"$f":"'Team Groups'!J128","v":"PORTUGAL (U19)"}]
["29 à 32",{"$f":"'Team Groups'!C29","v":"ENGLAND (U15)"},{"$f":"'Team Groups'!E29","v":"SPAIN  (U15)"},{"$f":"'Team Groups'!B18","v":"ITALY (Ladies)"}]
["33 à 36",{"$f":"'Team Groups'!G29","v":"FRANCE (U15)"},{"$f":"'Team Groups'!D29","v":"BELGIUM (U15)"},{"$f":"'Team Groups'!C18","v":"GERMANY (Ladies)"}]
["37 à 40",{"$f":"'Team Groups'!E34","v":"BELGIUM (U12)"},{"$f":"'Team Groups'!B34","v":"ITALY (U12)"},{"$f":"'Team Groups'!D18","v":"BELGIUM (Ladies)"}]
["41 à 44",{"$f":"'Team Groups'!C34","v":"FRANCE (U12)"},{"$f":"'Team Groups'!D34","v":"SPAIN  (U12)"},{"$f":"'Team Groups'!E18","v":"FRANCE (Ladies)"}]
["45 à 48"]
[]
[]
["Série 8 - 16h30"]
[]
["Tables"]
[null,null,null,"Referees"]
[]
["Final open"]
[]
["1 à 4",{"$f":"'Séries équipes full'!B659","v":"SPAIN (Open)"},{"$f":"'Séries équipes full'!H659","v":"ITALY (Open)"},{"$f":"'Séries équipes full'!#REF!","v":{"$error":"#REF!"}}]
[]
["Final veteran"]
[]
["5 à 8",{"$f":"'Séries équipes full'!B669","v":"BELGIUM (Veteran)"},{"$f":"'Séries équipes full'!H669","v":"ITALY (Veteran)"},{"$f":"'Séries équipes full'!J709","v":"ENGLAND (U19)"}]
[]
["Final ladies"]
[]
["9 à 12",{"$f":"'Team Groups'!H108","v":"BELGIUM (Ladies)"},{"$f":"'Team Groups'!H109","v":"ITALY (Ladies)"},{"$f":"'Séries équipes full'!#REF!","v":{"$error":"#REF!"}}]
[]
["Final U19"]
[]
["13 à 16",{"$f":"'Séries équipes full'!B689","v":"GERMANY (U19)"},{"$f":"'Séries équipes full'!H689","v":"BELGIUM (U19)"},{"$f":"'Séries équipes full'!#REF!","v":{"$error":"#REF!"}}]
[]
["Final U15"]
[]
["17 à 20",{"$f":"'Team Groups'!H138","v":"ITALY (U15)"},{"$f":"'Team Groups'!H139","v":"AUSTRIA  (U15)"},{"$f":"'Séries équipes full'!#REF!","v":{"$error":"#REF!"}}]
[]
["Final U12"]
[]
["21 à 24",{"$f":"'Team Groups'!H159","v":"ITALY (U12)"},{"$f":"'Team Groups'!H160","v":"BELGIUM (U12)"},{"$f":"'Séries équipes full'!#REF!","v":{"$error":"#REF!"}}]

{"sheet":"Calculs","index":6,"n_rows":41,"n_cols":9,"rows_kept":41,"cut":false,"hidden":false,"merged":[]}
[null,"P","W","L","N","+","-","d","PTS"]
["Cristian Fricano  (ITA)",3,3,0,0,10,3,7,9]
["Kristian Silagiev (ESP)",3,2,1,0,8,2,6,6]
["Joshua Foreman (ENG)",3,1,2,0,3,6,-3,3]
["Aurélien Feye (BEL)",3,0,3,0,0,10,-10,0]
[]
[]
[]
[]
[]
["U12",5,null,{"$f":"CONCATENATE(\"Winner \", A11, \" gr\",B11)","v":"Winner U12 gr5"}]
[{"$f":"$A$11","v":"U12"},{"$f":"B11","v":5},null,{"$f":"CONCATENATE(\"Second \", A12, \" gr\",B12)","v":"Second U12 gr5"}]
[{"$f":"$A$11","v":"U12"},{"$f":"B11","v":5},null,{"$f":"CONCATENATE(\"Third \", A13, \" gr\",B13)","v":"Third U12 gr5"}]
["U12",{"$f":"B11","v":5},null,{"$f":"CONCATENATE(\"Fourth \", A14, \" gr\",B14)","v":"Fourth U12 gr5"}]
[]
[]
[]
[]
[]
["U12",{"$f":"B11+1","v":6},null,{"$f":"CONCATENATE(\"Winner \", A20, \" gr\",B20)","v":"Winner U12 gr6"}]
["U12",{"$f":"B11+1","v":6},null,{"$f":"CONCATENATE(\"Second \", A21, \" gr\",B21)","v":"Second U12 gr6"}]
["U12",{"$f":"B11+1","v":6},null,{"$f":"CONCATENATE(\"Third \", A22, \" gr\",B22)","v":"Third U12 gr6"}]
["U12",{"$f":"B11+1","v":6},null,{"$f":"CONCATENATE(\"Fourth \", A23, \" gr\",B23)","v":"Fourth U12 gr6"}]
[]
[]
[]
[]
[]
["U12",{"$f":"B11+2","v":7},null,{"$f":"CONCATENATE(\"Winner \", A29, \" gr\",B29)","v":"Winner U12 gr7"}]
["U12",{"$f":"B11+2","v":7},null,{"$f":"CONCATENATE(\"Second \", A30, \" gr\",B30)","v":"Second U12 gr7"}]
["U12",{"$f":"B11+2","v":7},null,{"$f":"CONCATENATE(\"Third \", A31, \" gr\",B31)","v":"Third U12 gr7"}]
["U12",{"$f":"B11+2","v":7},null,{"$f":"CONCATENATE(\"Fourth \", A32, \" gr\",B32)","v":"Fourth U12 gr7"}]
[]
[]
[]
[]
[]
["U12",{"$f":"B11+3","v":8},null,{"$f":"CONCATENATE(\"Winner \", A38, \" gr\",B38)","v":"Winner U12 gr8"}]
["U12",{"$f":"B11+3","v":8},null,{"$f":"CONCATENATE(\"Second \", A39, \" gr\",B39)","v":"Second U12 gr8"}]
["U12",{"$f":"B11+3","v":8},null,{"$f":"CONCATENATE(\"Third \", A40, \" gr\",B40)","v":"Third U12 gr8"}]
["U12",{"$f":"B11+3","v":8},null,{"$f":"CONCATENATE(\"Fourth \", A41, \" gr\",B41)","v":"Fourth U12 gr8"}]

{"sheet":"EquipesNoms","index":7,"n_rows":73,"n_cols":15,"rows_kept":73,"cut":false,"hidden":false,"merged":[]}
["Open Team gr1A","Open Team gr1B","Open Team gr1C","Open Team gr2A","Open Team gr2B","Open Team gr2C","Open Team gr2D","Open Team gr3A","Open Team gr3B","Open Team gr3C","Open Team gr3D","Open Team gr4A","Open Team gr4B","Open Team gr4C","Open Team gr4D"]
["Juan Manuel Noguera","Luca Colangelo","Thomas Wittmann","Valéry Dejardin","Nuno Henriques","Alexander Ruf","Spyros Hantzaras","Andy Beskaby","Luca Martinelli","Jean-Marie Amberny","Lawrence Alvarez","Suguru Fujino","Christian Filippella","Maikel de Haas","Dmitry Lavrentcov"]
["Carlos Flores","Daniele Bertelli","Christian Haas","Christophe Dheur","Luis Abreu","Marcel Kwiatkowski","Spyros Patrinos","Gareth Christie","Colin Tarry","Fayçal Rouis","Niall Dean","Hideaki Wada","Daniel Cranston","Kenney Gerrets","Aton Volkov"]
["David Gonzalez","Saverio Bari","Alexander Haas","Bessim Golger","Sergio Ramos","Marcus Tilgner","Kostas Seses","Rob Conway","Brett Price","Jean-Guillaume Einsle","Jonathan Dotto","Koshiro Shibata","Mike Tillman","Patrick de Jong","Maksim Gulyev"]
["José David Somoza","Luca Zambello","Heinz Eder","Rémy Huynh","Diogo Pereira","Roland Popp","Giorgos Koutis","Malcolm Lees","Terry Arnold","Rémi Soret","Adrian Holmes",null,"Patrick Sheridan","Henk Landzaat","Andrey Kudryashov"]
["Antonio Casin","Massimiliano Nastasi","Wolfgang Haas","Sébastien Scheen",null,"Janus Gersie","Velissarios Fragakis",null,"Matthew Atkin","Axel Donval","Francis Avellano",null,null,"Mirjam de Jong"]
["Jesus Moreno","Massimo Bolognino","Wolfgang Leitner","Sami Targui",null,null,"Lazaros Papakonstantinou",null,null,"Romain Lafontaine",null,null,null,"Chantal de Jong"]
[null,null,null,null,null,null,"Nikos Haratsis",null,null,null,null,null,null,"Quincy Gerrets"]
[null,null,null,null,null,null,"Kostas Stamokostas"]
[]
["OpenSpain","OpenItaly","OpenAustria","OpenBelgium","OpenPortugal","OpenGermany","OpenGreece","OpenScotland","OpenEngland","OpenFrance","OpenGibraltar","OpenJapan","OpenUSA","OpenNetherlands","OpenRussia"]
["Opesp","Opita","Opaut","Opbel","Opport","Opall","Opgre","Opeco","Opang","Opfra","Opgib","Opjap","Opusa","Ophol","Oprus"]
[]
[]
[]
["Vet Team gr1A","Vet Team gr1B","Vet Team gr1C","Vet Team gr2A","Vet Team gr2B","Vet Team gr2C","Vet Team gr2D","Vet Team gr3A","Vet Team gr3B","Vet Team gr3C","Vet Team gr3D"]
["Vicenç Prats Salat","Gianfranco Calonico","Erich Hinkelmann","Vito Di Ruggiero","Dimitris Stamatopoulos","Arnold Mair","Justin Finch","Thierry Vivron","Jason Pisani","Paul O'Donovan Rossa","John Field"]
["Juan Carlos Granados","Patrizio Lazzaretti","Stefan Sandner","Alain Jadot","Chris Aggelinas","Rainer Vogt","Jeremy Bradley","Eric Naszalyi","Charles Aquilina","Dario Passadore","Patrick Dean"]
["Luis Lopez ","Stefano De Francesco","Manfred Pawlica","Benoît Massart","Panagiotis Haratsis","Frank Stiller","Brian Daley","Axel Modeste","Massimo Cremona","Paul Eyes","Guy Palmer"]
["Arturo Martinez","Francesco Mattiangeli","Günther Bamberzky","Daniel Scheen","Giorgos Aggelinas","Tom Horn","Phil Redman","Xavier Dubois","John Zammit","Gregg Deinhart","Jose Luis Bonavia"]
["Ferran Coll","Massimiliano Croatti","David Busch","Pascal Scheen","Kostas Kaperonis","Frank Hagenkötter","Mathew  Atkin","Stéphane Pommier","Joseph Zammit Pavia",null,"Richard Berllaque"]
["Julio Candelas","Mario Corradi","Karl-Heinz Haider","Eric  Threis","Nikos Naskos","Thossa Busing","Terry Arnold"]
["Antonio Montano",null,null,null,"Giorgos Drazinakis"]
[]
["Veesp","Veita","Veaut","Vebel","Vegre","Veall","Veang","Vefra","Vemal","Veusa","Vegib"]
[]
[]
[]
["Ladies Team gr1A","Ladies Team gr1B","Ladies Team gr1C","Ladies Team gr1D"]
["Paola Forlani","Elodie Bertholet","Audrey Herbaut","Victoria Büsing"]
["Giulia Brillantino","Cynthia Bouchez","Françoise Guyot","Maike Krause"]
["Eleonora Buttitta","Margault Delval","Sylvie Guyot ","Daria Prazynski"]
["Hélène Boniface","Emilie Despretz","Arielle Briant","Annika Hentrich"]
["Sara Guercia","Delphine Dieudonné",null,"Conny Vulpes"]
["Giuditta Lo Cascio","Lydie Pinchart"]
[]
["Feita","Febel","Fefra","Feall"]
[]
[]
[]
["U19 Team gr1A","U19 Team gr1B","U19 Team gr1C","U19 Team gr2A","U19 Team gr2B","U19 Team gr2C","U19 Team gr2D"]
["Nicola Borgo","Martin Antoine","Raphaël Pommier","Kai Hagenkötter","Afonso Pereira","Joseph Agius","Elliott Bellefontaine"]
["Andrea Ciccarelli","Steffen Despretz","Théo Modeste","Fabio Bianco","Ricardo Jose","Jurgen Balzan","Connor Bowden"]
["Matteo Ciccarelli","Nathan Dizier","Paul Naszalyi","Alwin Krause ","Vasco Henriques","Nealmark Bonnici","Chris Bowen"]
["Claudio Panebianco","Florian Giaux","Arnaud Le Teno","Moritz Jung","Carolina Villarigues",null,"Kye Arnold"]
["Marco Di Vito","Maxime Muraille",null,"Yannick Matusch"]
["Paolo Zambello","William Van den Houte",null,"Manuel Politz"]
[]
["Juita","Jubel","Jufra","Juall","Juesp","Jumal","Juang"]
[]
[]
[]
["U15 Team gr1A","U15 Team gr1B","U15 Team gr1C","U15 Team gr1D","U15 Team gr1E","U15 Team gr1F"]
["Riccardo Lazzari","Corentin Boltz","Eliott Legall","Marios Strommer","Jorge Pinero","Thomas Price"]
["Claudio La Torre","Corentin Bouchez","Yanis Farza","Adam Kraus","Antonio Garcia Fernandez","Rhys Williams"]
["Antonio La Torre","Louison Giaux","Paul Offmann","Jonathan Nichtenberger","Gonzalo Garcia- Guereta","Conor Atkin"]
["Matteo Brillantino","Maxime Rairoux","Florentine Ausset","Lukas Eppensteiner",null,"Joshua Foreman"]
["Leonardo Giudice","Noé Scheen",null,"Daniel Vranowitz"]
["Andrea Bolognino","Mathéo Grégoire"]
[]
["Caita","Cabel","Cafra","Caaut","Caesp","Caang"]
[]
[]
[]
["U12 Team gr1A","U12 Team gr1B","U12 Team gr1C","U12 Team gr1D"]
["Matteo Cammarata","Noah Denne","Carlos Pinto","Quentin Ausset"]
["Giorgio Giudice","Aurélien Feye","Kristian Sylagiev","Louis Fouetillou"]
["Riccardo Natoli","Alex Genart","Jesus Maireles","Marc Offmann"]
["Mattia Ferrante","Basile Magermans","Paula Maireles","Victor Dubuc"]
["Francesco Tozzi","Lucas Pere"]
["Cristian Fricano","Jann Segers"]
[]
["Miita","Mibel","Miesp","Mifra"]